{"text_format":"1","workbook":"xlsx","n_sheets":11,"sheets":["Start","Overview","FC_NTP","EnB","EnD","El_C","DATABASES","Country","FAOSTAT_Land","Country_Translation","LANG_DATABASE"],"not_rendered":{"charts":6,"images":9,"macros":1,"external_links":2,"defined_names":808,"comments":2,"pivot_tables":0},"unopened":[],"bounds":{"document_bytes":16777216,"sheet_cells":100000,"rows_first":2000,"rows_last":500,"rows_between":2000,"halvings":0,"cell_chars":16384,"cell_head_chars":4096},"cells_cut":0,"cells_raw":0,"read":"whole","date_system":"1900"}

{"sheet":"Start","index":0,"n_rows":8,"n_cols":29,"rows_kept":8,"cut":false,"hidden":false,"merged":[[6,2,6,5],[6,8,6,12],[1,2,1,15],[55,2,59,15]]}
[null,null,null,null,null,null,null,null,null,null,null,null,null,null,null,null,null,null,null,null,null,null,null,null,null,null,null,1,{"$f":"title212","v":"Select"}]
[null,"EN",{"$f":"title2","v":"COUNTRY STATUS"},null,null,null,null,null,null,null,null,null,null,null,null,null,null,null,null,null,null,null,null,null,null,null,null,2,{"$f":"title213","v":"the country"}]
[null,null,null,null,null,null,null,null,null,null,null,null,null,null,null,null,null,null,null,null,null,null,null,null,null,null,null,3,{"$f":"title214","v":"Region:"}]
[null,null,null,{"$f":"title3","v":"Country:"},null,"Select a country",null,null,null,null,null,null,null,null,null,null,null,null,null,null,null,null,null,null,null,null,null,4,{"$f":"title215","v":"Province:"}]
[null,null,null,null,null,null,null,null,null,null,null,null,null,null,null,null,null,null,null,null,null,null,null,null,null,null,null,5,{"$f":"title216","v":"District:"}]
[null,null,null,null,null,null,null,null,null,null,null,null,null,null,null,null,null,null,null,null,null,null,null,null,null,null,null,7,{"$f":"title217","v":"Area:"}]
[null,null,{"$f":"title5","v":"BEFS Rapid Appraisal for"},null,null,null,"Select",null,null,null,null,null,null,null,null,null,null,null,null,null,null,null,null,null,null,null,null,8,{"$f":"title218","v":"Other:"}]
[null,null,null,null,null,null,null,null,null,null,null,null,null,null,null,null,null,null,null,null,null,null,null,null,null,null,null,9]

{"sheet":"Overview","index":1,"n_rows":75,"n_cols":31,"rows_kept":75,"cut":false,"hidden":false,"merged":[[15,10,15,11],[19,7,19,8],[19,14,19,15],[30,14,30,15],[16,10,16,11],[30,12,30,13],[23,10,23,11],[12,8,15,8],[16,8,18,8],[29,10,29,11],[24,10,24,11],[25,10,25,11],[26,10,26,11],[27,10,27,11],[17,10,17,11],[44,3,44,4],[45,3,45,4],[46,3,46,4],[47,3,47,4],[44,7,44,8],[45,7,45,8],[46,7,46,8],[1,2,1,15],[6,12,6,13],[6,14,6,15],[11,10,11,11],[21,10,21,15],[21,2,21,8],[6,2,6,4],[9,2,9,8],[9,10,9,15],[12,10,12,11],[19,12,19,13],[11,2,11,4],[19,5,19,6],[14,10,14,11],[3,2,3,3],[13,10,13,11],[30,7,30,8],[23,2,23,3],[54,10,54,12],[46,5,46,6],[54,2,54,4],[27,2,27,3],[28,2,28,3],[43,3,43,4],[50,7,50,8],[53,3,53,4],[53,5,53,6],[53,7,53,8],[51,3,51,4],[51,5,51,6],[51,7,51,8],[30,5,30,6],[41,10,41,15],[43,7,43,8],[43,5,43,6],[41,2,41,8],[49,3,49,4],[49,5,49,6],[49,7,49,8],[45,5,45,6],[44,5,44,6],[50,3,50,4],[50,5,50,6],[74,3,74,4],[47,5,47,6],[48,3,48,4],[48,5,48,6],[61,2,61,15],[48,7,48,8],[47,7,47,8],[56,14,56,15],[55,2,55,4],[52,3,52,4],[52,5,52,6],[52,7,52,8],[56,7,56,8],[63,3,63,4],[56,11,56,12],[55,7,55,8],[56,3,56,5],[54,5,54,6],[55,5,55,6],[54,7,54,8],[55,10,55,12],[69,3,69,4],[32,2,32,8],[35,10,35,11],[37,7,37,8],[32,10,32,15],[34,10,34,11],[34,2,34,4],[35,2,35,4],[37,14,37,15],[37,5,37,6],[36,2,36,4],[36,10,36,11],[70,3,70,4],[71,3,71,4],[72,3,72,4],[73,3,73,4],[64,3,64,4],[65,3,65,4],[66,3,66,4],[67,3,67,4],[68,3,68,4]]}
[null,null,null,null,null,null,null,null,null,null,null,null,null,null,null,null,null,null,null,null,null,null,null,null,null,null,null,null,null,1,{"$f":"title213","v":"the country"}]
[null,null,{"$f":"title8","v":"COUNTRY OVERVIEW"},null,null,null,null,null,null,null,null,null,null,null,null,null,null,null,null,null,null,null,null,null,null,null,null,null,null,2,{"$f":"title214","v":"Region:"}]
[null,null,null,null,null,null,null,null,null,null,null,null,null,null,null,null,null,null,null,null,null,null,null,null,null,null,null,null,null,3,{"$f":"title215","v":"Province:"}]
[null,null,"COUNTRY:",null,{"$f":"Start!F4","v":"Select a country"},null,null,null,null,null,null,null,null,null,null,null,null,null,null,null,null,null,null,null,null,null,null,null,null,4,{"$f":"title216","v":"District:"}]
[null,null,null,null,null,null,null,null,null,null,null,null,null,null,null,null,null,null,null,null,null,null,null,null,null,null,null,null,null,5,{"$f":"title217","v":"Area:"}]
[null,null,null,null,null,null,null,null,null,null,null,null,null,null,null,null,null,null,null,null,null,null,null,null,null,null,null,null,null,7,{"$f":"title218","v":"Other:"}]
[null,null,{"$f":"title5","v":"BEFS Rapid Appraisal for"},null,null,{"$f":"IF(Start!G7=title212,\"\",Start!G7)","v":""},{"$f":"IF(Start!I7=\"\",\"\",Start!I7)","v":""},null,null,null,null,null,{"$f":"title10","v":"Enter data into white cells"},null,{"$f":"title11","v":"Grey cells are calculated"},null,null,null,null,null,null,null,null,null,null,null,null,null,null,8]
[null,null,null,null,null,null,null,null,null,null,null,null,null,null,null,null,null,null,null,null,null,null,null,null,null,null,null,null,null,9]
[null,null,null,null,null,null,null,null,null,null,null,null,null,null,null,null,null,null,null,null,null,null,null,null,null,null,null,null,null,10]
[null,null,{"$f":"title12","v":"POPULATION"},null,null,null,null,null,null,null,{"$f":"title248","v":"ECONOMIC AND AGRICULTURAL INDICATORS"},null,null,null,null,null,null,null,null,null,null,null,null,null,null,null,null,null,null,11]
{"$rows_left_out":66}
{"sheet":"FC_NTP","index":2,"n_rows":70,"n_cols":20,"rows_kept":70,"cut":false,"hidden":false,"merged":[[57,8,57,9],[69,3,69,7],[39,3,39,7],[54,3,54,7],[6,7,6,8],[6,17,6,19],[1,2,1,19],[6,14,6,16],[27,8,27,9],[27,18,27,19],[39,13,39,17],[42,18,42,19],[54,13,54,17],[9,6,9,14],[42,8,42,9]]}
["."]
[null,null,{"$f":"title63","v":"NET TRADE POSITION FOR KEY FOOD CROPS"}]
[]
[null,null,null,{"$f":"title3","v":"Country:"},null,{"$f":"Overview!$E$4","v":"Select a country"}]
[]
[]
[null,null,{"$f":"title5","v":"BEFS Rapid Appraisal for"},null,null,null,{"$f":"Overview!F7","v":""},{"$f":"IF(Start!I7=\"\",\"\",Start!I7)","v":""},null,null,null,null,null,null,{"$f":"title10","v":"Enter data into white cells"},null,null,{"$f":"title11","v":"Grey cells are calculated"}]
[]
[]
[null,null,null,null,null,null,{"$f":"title66","v":"Net Trade Position for key food crops in the past 10 years"}]
{"$rows_left_out":61}
{"sheet":"EnB","index":3,"n_rows":60,"n_cols":15,"rows_kept":60,"cut":false,"hidden":false,"merged":[[59,3,59,5],[1,2,1,14],[8,8,8,13],[8,2,8,7],[22,2,22,13],[6,2,6,3],[6,4,6,5],[6,13,6,14],[6,11,6,12],[46,2,46,3]]}
[]
[null,null,{"$f":"title85","v":"ENERGY BALANCE"}]
[]
[null,null,{"$f":"title3","v":"Country:"},{"$f":"Overview!$E$4","v":"Select a country"}]
[]
[]
[null,null,{"$f":"title5","v":"BEFS Rapid Appraisal for"},null,{"$f":"+Overview!F7","v":""},null,{"$f":"IF(Overview!G7=\"\",\"\",Overview!G7)","v":""},null,null,null,null,{"$f":"title10","v":"Enter data into white cells"},null,{"$f":"title11","v":"Grey cells are calculated"}]
[]
[null,null,{"$f":"title89","v":"Total primary energy supply "},null,null,null,null,null,{"$f":"title90","v":"Final energy consumption"}]
[]
{"$rows_left_out":51}
{"sheet":"EnD","index":4,"n_rows":49,"n_cols":33,"rows_kept":49,"cut":false,"hidden":false,"merged":[[20,2,20,3],[23,2,23,3],[24,2,24,3],[45,6,45,7],[45,4,45,5],[27,2,27,4],[28,2,28,4],[32,4,32,5],[32,6,32,7],[32,2,33,2],[27,5,27,6],[28,5,28,6],[27,7,27,8],[28,7,28,8],[1,2,1,13],[6,2,6,4],[6,12,6,13],[6,10,6,11],[26,5,26,6],[26,7,26,8],[9,3,9,10],[10,7,10,9],[11,7,11,9],[10,10,10,11],[11,10,11,11],[10,2,10,3],[10,4,10,5],[11,2,11,3],[11,4,11,5],[19,2,19,3]]}
[]
[null,null,{"$f":"title115","v":"CURRENT ENERGY DEMAND AT NATIONAL LEVEL"}]
[]
[null,null,null,{"$f":"title3","v":"Country:"},{"$f":"Overview!$E$4","v":"Select a country"}]
[]
[]
[null,null,{"$f":"title5","v":"BEFS Rapid Appraisal for"},null,null,{"$f":"+Overview!F7","v":""},{"$f":"IF(Overview!G7=\"\",\"\",Overview!G7)","v":""},null,null,null,{"$f":"title10","v":"Enter data into white cells"},null,{"$f":"title11","v":"Grey cells are calculated"}]
[]
[]
[null,null,null,{"$f":"title271","v":"Energy Consumption Indicators"}]
{"$rows_left_out":40}
{"sheet":"El_C","index":5,"n_rows":49,"n_cols":14,"rows_kept":49,"cut":false,"hidden":false,"merged":[[47,8,47,9],[47,10,47,11],[43,8,43,9],[43,10,43,11],[44,8,44,9],[44,10,44,11],[45,8,45,9],[45,10,45,11],[39,8,39,9],[39,10,39,11],[40,8,40,9],[40,10,40,11],[41,8,41,9],[41,10,41,11],[42,8,42,9],[42,10,42,11],[46,8,46,9],[46,10,46,11],[14,6,14,7],[15,6,15,7],[16,8,16,9],[17,8,17,9],[48,4,48,11],[27,4,27,11],[31,5,32,5],[30,2,30,13],[31,6,32,7],[31,8,32,9],[31,10,32,11],[33,6,33,7],[33,8,33,9],[33,10,33,11],[34,8,34,9],[34,10,34,11],[35,8,35,9],[35,10,35,11],[36,8,36,9],[36,10,36,11],[37,8,37,9],[37,10,37,11],[38,8,38,9],[38,10,38,11],[10,12,10,13],[21,10,21,11],[22,10,22,11],[23,10,23,11],[24,10,24,11],[10,8,11,9],[12,8,12,9],[13,8,13,9],[14,8,14,9],[20,8,20,9],[15,8,15,9],[31,12,31,13],[31,4,32,4],[31,2,32,3],[21,8,21,9],[22,8,22,9],[23,8,23,9],[24,8,24,9],[25,10,25,11],[25,6,25,7],[23,6,23,7],[24,6,24,7],[1,2,1,13],[10,2,11,3],[10,4,11,4],[10,5,11,5],[9,2,9,13],[26,10,26,11],[6,12,6,13],[6,9,6,11],[25,8,25,9],[26,8,26,9],[10,10,11,11],[12,10,12,11],[13,10,13,11],[14,10,14,11],[15,10,15,11],[16,10,16,11],[17,10,17,11],[18,10,18,11],[19,10,19,11],[20,10,20,11],[18,8,18,9],[19,8,19,9],[10,6,11,7],[12,6,12,7],[6,2,6,4],[47,6,47,7],[40,6,40,7],[41,6,41,7],[42,6,42,7],[43,6,43,7],[44,6,44,7],[35,6,35,7],[36,6,36,7],[37,6,37,7],[38,6,38,7],[39,6,39,7],[26,6,26,7],[34,6,34,7],[18,6,18,7],[19,6,19,7],[20,6,20,7],[21,6,21,7],[22,6,22,7],[45,6,45,7],[46,6,46,7],[13,6,13,7],[16,6,16,7],[17,6,17,7]]}
[]
[null,null,{"$f":"title176","v":"ELECTRICITY CONSUMPTION CALCULATOR"}]
[]
[null,null,{"$f":"title3","v":"Country:"},{"$f":"Overview!$E$4","v":"Select a country"}]
[]
[]
[null,null,{"$f":"title5","v":"BEFS Rapid Appraisal for"},null,null,{"$f":"+Overview!F7","v":""},null,null,null,{"$f":"title10","v":"Enter data into white cells"},null,null,{"$f":"title11","v":"Grey cells are calculated"}]
[]
[]
[null,null,{"$f":"title178","v":"Household profile - rural household"}]
{"$rows_left_out":40}
{"sheet":"DATABASES","index":6,"n_rows":5,"n_cols":2,"rows_kept":5,"cut":false,"hidden":true,"merged":[[4,1,12,15]]}
[]
[]
[]
[]
[null,{"$f":"title235","v":"The following sheets contain databases. Refer to the manual for their description."}]

{"sheet":"Country","index":7,"n_rows":199,"n_cols":59,"rows_kept":199,"cut":false,"hidden":true,"merged":[]}
[null,null,"WB:WDI 2021",null,"FAOSTAT 2021",null,null,null,"AQUASTAT 2021",null,null,null,"WB:WDI 2021",null,null,null,null,null,null,null,null,null,null,null,null,null,null,null,null,null,null,null,null,null,null,null,null,null,null,null,null,null,null,null,null,null,null,null,null,null,null,null,null,null,"Emissions"]
[null,null,{"$f":"title18","v":"Rural population"},{"$f":"title17","v":"Total population (1000 inhab)"},{"$f":"title247","v":"Livestock, value added (% of Agricultural Value Added)"},{"$f":"title261","v":"LSUs per 100 people, total population (LSU)"},{"$f":"title255","v":"Total area equipped for irrigation (1000 ha)"},{"$f":"_xlfn.CONCAT(G2,H4)","v":"Total area equipped for irrigation (1000 ha)year"},{"$f":"title252","v":"Long-term average precipitation (mm/year)"},{"$f":"CONCATENATE(I2,J3)","v":"Long-term average precipitation (mm/year)year"},{"$f":"title253","v":"Total internal renewable water resources (10^9 m3/year)"},{"$f":"CONCATENATE(K2,L3)","v":"Total internal renewable water resources (10^9 m3/year)year"},{"$f":"title24","v":"GDP per capita (current US$)"},{"$f":"CONCATENATE(M2,N3)","v":"GDP per capita (current US$)year"},{"$f":"title245","v":"GDP per capita (constant 2010 US$)"},{"$f":"CONCATENATE(O2,P3)","v":"GDP per capita (constant 2010 US$)year"},{"$f":"title26","v":"GDP/capita, PPP (const. 2017, int. $)"},{"$f":"CONCATENATE(Q2,R3)","v":"GDP/capita, PPP (const. 2017, int. $)year"},{"$f":"title131","v":"GDP per unit of energy use (constant 2011 PPP $ per kg of oil equivalent)"},{"$f":"CONCATENATE(S2,T3)","v":"GDP per unit of energy use (constant 2011 PPP $ per kg of oil equivalent)year"},{"$f":"title27","v":"Agriculture, value added (% of GDP)"},{"$f":"CONCATENATE(U2,V3)","v":"Agriculture, value added (% of GDP)year"},{"$f":"title41","v":"Undernourished population (%)"},{"$f":"CONCATENATE(W2,X3)","v":"Undernourished population (%)year"},{"$f":"title43","v":"Energy use (kg of oil eq. per capita)"},{"$f":"CONCATENATE(Y2,Z3)","v":"Energy use (kg of oil eq. per capita)year"},{"$f":"title44","v":"Electric power consumption (kWh per capita)"},{"$f":"CONCATENATE(AA2,AB3)","v":"Electric power consumption (kWh per capita)year"},{"$f":"title45","v":"Access to electricity (% of population)"},{"$f":"CONCATENATE(AC2,AD3)","v":"Access to electricity (% of population)year"},{"$f":"title42","v":"Poverty headcount ratio at national poverty line (% of pop.)"},{"$f":"CONCATENATE(AE2,AF3)","v":"Poverty headcount ratio at national poverty line (% of pop.)year"},{"$f":"title246","v":"Inflation, consumer prices (annual %)"},{"$f":"CONCATENATE(AG2,AH3)","v":"Inflation, consumer prices (annual %)year"},{"$f":"title251","v":"Annual freshwater withdrawals, agriculture (% of total freshwater withdrawal)"},{"$f":"CONCATENATE(AI2,AJ3)","v":"Annual freshwater withdrawals, agriculture (% of total freshwater withdrawal)year"},{"$f":"title266","v":"Access to clean fuels and technologies for cooking (% of population)"},{"$f":"CONCATENATE(AK2,AL3)","v":"Access to clean fuels and technologies for cooking (% of population)year"},{"$f":"title267","v":"Access to electricity, rural (% of rural population)"},{"$f":"CONCATENATE(AM2,AN3)","v":"Access to electricity, rural (% of rural population)year"},{"$f":"title268","v":"Access to electricity, urban (% of urban population)"},{"$f":"CONCATENATE(AO2,AP3)","v":"Access to electricity, urban (% of urban population)year"},{"$f":"title269","v":"Freshwater withdrawal as a proportion of available freshwater resources (%)"},{"$f":"CONCATENATE(AQ2,AR3)","v":"Freshwater withdrawal as a proportion of available freshwater resources (%)year"},{"$f":"title270","v":"Energy intensity level of primary energy (MJ/$2011 PPP GDP)"},{"$f":"CONCATENATE(AS2,AT3)","v":"Energy intensity level of primary energy (MJ/$2011 PPP GDP)year"},{"$f":"title256","v":"Total final energy consumption (TFEC) (TJ) "},{"$f":"CONCATENATE(AU2,AV3)","v":"Total final energy consumption (TFEC) (TJ) year"},{"$f":"title257","v":"Renewable energy share of TFEC (%)"},{"$f":"CONCATENATE(AW2,AX3)","v":"Renewable energy share of TFEC (%)year"},{"$f":"title258","v":"Total electricity output (GWh) "},{"$f":"CONCATENATE(AY2,AZ3)","v":"Total electricity output (GWh) year"},{"$f":"title259","v":"Renewable electricity output (% of total electricity output)"},{"$f":"CONCATENATE(BA2,BB3)","v":"Renewable electricity output (% of total electricity output)year"},null,"Mitigation Target","Baseline","Target Year","Mitigation Summary"]
[null,null,"(1000 inh) Element code 551","Element code 511",null,null,"Item 6690",null,"data",{"$f":"title236","v":"year"},"data",{"$f":"title236","v":"year"},"data",{"$f":"title236","v":"year"},"data",{"$f":"title236","v":"year"},"data",{"$f":"title236","v":"year"},"data",{"$f":"title236","v":"year"},"data",{"$f":"title236","v":"year"},"data",{"$f":"title236","v":"year"},"data",{"$f":"title236","v":"year"},"data",{"$f":"title236","v":"year"},"data",{"$f":"title236","v":"year"},"data",{"$f":"title236","v":"year"},"data",{"$f":"title236","v":"year"},"data",{"$f":"title236","v":"year"},"data",{"$f":"title236","v":"year"},"data",{"$f":"title236","v":"year"},"data",{"$f":"title236","v":"year"},"data",{"$f":"title236","v":"year"},"data",{"$f":"title236","v":"year"},"data",{"$f":"title236","v":"year"},"data",{"$f":"title236","v":"year"},"data",{"$f":"title236","v":"year"},"data",{"$f":"title236","v":"year"},"data","data","data","data","data"]
["Country name","Country code",2020,2020,2014,2014,null,{"$f":"title236","v":"year"}]
[{"$f":"Country2","v":"Afghanistan"},2,28797,38928,39.89,21.6,3208,2019,327,2017,65.33,2017,509,2020,549,2020,1979,2020,null,null,27.01,2020,25.6,2019,null,null,null,null,97.7,2019,54.5,2016,2.2999999999999998,2019,98.17,2017,32.44,2016,96.9,2019,100,2019,54.76,2017,2.46,2015,136427,2015,21.42,2018,1034,2015,86.05,2015,"Relative emission reduction","0.136","BAU","2030","There will be a 13.6% reduction in GHG emissions by 2030 compared to a business as usual (BAU) 2030 scenario, conditional on external support."]
[{"$f":"Country3","v":"Albania"},3,1075,2838,44.19,26.6,357,2019,1485,2017,30.2,2017,5215,2020,5064,2020,13295,2020,13.235771654698386,2014,19.25,2020,3.9,2019,808,2014,2309,"2014",100,2019,14.3,2012,1.62,2020,63.74,2017,77.42,2016,100,2019,100,2019,7.14,2017,2.89,2015,81718,2015,38.270000000000003,2018,5895,2015,100,2015,"Relative emission reduction","0.115","BAU","2030","The INDC of Albania is a baseline scenario target: it commits to reduce CO2 emissions compared to the baseline scenario in the period of 2016 and 2030 by 11.5 %. This reduction means 708 kT carbon‐dioxide emission reduction in 2030."]
[{"$f":"Country4","v":"Algeria"},4,11518,43851,37.67,16.399999999999999,1365,2019,89,2017,11.67,2017,3310,2020,4363,2020,10682,2020,10.206148686636755,2014,14.23,2020,2.5,2019,1321,2014,1356,"2014",99.5,2019,5.5,2011,2.42,2020,63.76,2017,92.62,2016,98.68,2019,99.8,2019,137.91999999999999,2017,4.13,2015,1413990,2015,0.19,2018,68798,2015,0.32,2015,"Relative emission reduction","7-22%","BAU","2030","A greenhouse gas emission reduction of 7% to 22% by 2030 compared to business as usual (BAU) levels, conditional on external assistance for the financing of the development and transfer of technologies and capacity building. A 7% GHG reduction will be achieved with domestic means."]
[{"$f":"Country5","v":"Andorra"},6,9,77,null,null,0,2019,null,null,0.31559999999999999,2017,40897,2019,40403,2020,null,null,null,null,null,null,null,null,null,null,null,null,100,2019,null,null,null,null,null,null,100,2016,100,2019,100,2019,null,null,null,null,8317,2015,18.510000000000002,2018,99,2015,86.12,2015,"Relative emission reduction","0.37","BAU","2030","[Translated] 37% of emission reduction of annual emissions compared to business a usual levels by 2030."]
[{"$f":"Country6","v":"Angola"},7,10903,32866,17.329999999999998,16,86,2019,1010,2017,148.4,2017,1896,2020,2891,2020,6198,2020,12.509980692649714,2014,9.43,2020,17.3,2019,545,2014,312,"2014",45.67,2019,32.299999999999997,2018,17.079999999999998,2019,20.78,2017,48.05,2016,null,null,72.37,2019,1.87,2017,3.61,2015,491789,2015,56.79,2018,9764,2015,53.17,2015,"Relative emission reduction","0.5","BAU","2030","The country is committed to stabilize its emissions by reducing GHG emissions up to 50% below BAU emission levels by 2030 through unconditional and conditional actions targeting the following sectors: Power generation from renewable sources; and Reforestation."]
[{"$f":"Country7","v":"Antigua and Barbuda"},8,74,98,37.08,11.9,0,2019,1030,2017,5.1999999999999998E-2,2017,14450,2020,12870,2020,17956,2020,null,null,2.14,2020,null,null,null,null,null,null,100,2019,null,null,1.43,2019,15.65,2017,98.75,2016,100,2019,100,2019,8.4600000000000009,2017,3.89,2015,4701,2015,0.9,2018,340,2015,0,2015,"Policies and actions","N/A","2006","2020/2030","Conditional mitigation targets\n1. By 2020, establish efficiency standards for the implementation of all vehicles and appliances.\n2. By 2020, finalize the technical studies with the intention to construct and operationalize a waste to energy (WTE) plant by 2025.\n3. By 20-30, achieve an energy matrix with 50MW of electricity from renewable sources both on and off-grid in the public and private sectors.\n4. By 2030, all remaining wetlands and watershed areas with carbon sequestration potential are protected as carbon sinks."]
{"$rows_left_out":190}
{"sheet":"FAOSTAT_Land","index":8,"n_rows":199,"n_cols":13,"rows_kept":199,"cut":false,"hidden":true,"merged":[[1,0,1,1],[1,2,1,3],[3,0,3,1],[3,2,3,3]]}
["FAOSTAT 2021",null,null,null,{"$f":"CONCATENATE(E2,$M$1)","v":"Agricultural area2019"},{"$f":"CONCATENATE(F2,$M$1)","v":"Arable land2019"},"Country area2019","Forest area2019","Land area2019","Permanent crops2019",null,"Last available data: ",2019]
["Elements  ",null,"Areas  ",null,{"$f":"title35","v":"Agricultural area"},{"$f":"title36","v":"Arable land"},{"$f":"title33","v":"Country area"},{"$f":"title38","v":"Forest area"},{"$f":"title34","v":"Land area"},{"$f":"title37","v":"Permanent crops"},null,"Last update:","2021-10-13"]
[null,null,null,null,6610,6621,6600,6661,6601,6650]
[null,null,null,null,2019,2019,2019,2019,2019,2019]
["Area (1000 Ha)",5110,{"$f":"Country2","v":"Afghanistan"},2,38010,7788,65286,1208,65223,222]
["Area (1000 Ha)",5110,{"$f":"Country3","v":"Albania"},3,1174,610,2875,789,2740,86]
["Area (1000 Ha)",5110,{"$f":"Country4","v":"Algeria"},4,41359,7505,238174,1939,238174,1012]
["Area (1000 Ha)",5110,{"$f":"Country5","v":"Andorra"},6,19,1,47,16,47,0]
["Area (1000 Ha)",5110,{"$f":"Country6","v":"Angola"},7,56952,4900,124670,67162,124670,315]
["Area (1000 Ha)",5110,{"$f":"Country7","v":"Antigua and Barbuda"},8,9,4,44,8,44,1]
{"$rows_left_out":190}
{"sheet":"Country_Translation","index":9,"n_rows":463,"n_cols":7,"rows_kept":463,"cut":false,"hidden":true,"merged":[]}
[]
[null,"Selection",{"$f":"LANG_DATABASE!C2","v":1}]
["EN","English",1]
["FR","French",2]
["ES","Spanish",3]
[]
[]
[]
[]
[]
{"$rows_left_out":454}
{"sheet":"LANG_DATABASE","index":10,"n_rows":286,"n_cols":8,"rows_kept":286,"cut":false,"hidden":true,"merged":[]}
[]
[null,"Selection",{"$f":"VLOOKUP(Start!B2,$A$3:$C$5,3,FALSE)","v":1}]
["EN","English",1]
["FR","French",2,null,null,"Albania"]
["ES","Spanish",3]
[]
[null,null,null,null,null,null,"Province:"]
[]
[]
[]
{"$rows_left_out":276}