{"text_format":"1","workbook":"xlsx","n_sheets":33,"sheets":["DUMMY_DATABASE","Country","PROPERTIES_DATABASE","Model Calculations_ALL","MATERIALS_ALL","Label","Title","Start","Process Description","Energy_Demand","Data entry needs","COST_SIZE1","FA_FIXED_SIZE1","FA_FLOATING_SIZE1","FA_TUBULAR_SIZE1","COST_SIZE2","FA_FIXED_SIZE2","FA_FLOATING_SIZE2","FA_TUBULAR_SIZE2","COST_SIZE3","FA_FIXED_SIZE3","FA_FLOATING_SIZE3","FA_TUBULAR_SIZE3","COST_SIZE4","FA_FIXED_SIZE4","FA_FLOATING_SIZE4","FA_TUBULAR_SIZE4","Summary of Results-By Size","Summary of Results-SIZE1","Summary of Results-SIZE2","Summary of Results-SIZE3","Summary of Results-SIZE4","Summary of Results-comparative"],"not_rendered":{"charts":60,"images":38,"macros":1,"external_links":1,"defined_names":563,"comments":6,"pivot_tables":0},"unopened":[],"bounds":{"document_bytes":16777216,"sheet_cells":100000,"rows_first":2000,"rows_last":500,"rows_between":2000,"halvings":0,"cell_chars":16384,"cell_head_chars":4096},"cells_cut":0,"cells_raw":0,"read":"whole","date_system":"1900"}

{"sheet":"DUMMY_DATABASE","index":0,"n_rows":245,"n_cols":18,"rows_kept":245,"cut":false,"hidden":true,"merged":[]}
[null,null,null,null,null,null,null,null,null,null,null,"VS","Manure available",null,"Energy consumption",{"$f":"title36","v":"Price"},{"$f":"title38","v":"Consumption"}]
[null,null,null,null,null,null,null,null,null,null,null,"Kg VS/hh/day","Kg manure/hh/day",null,"per rural household","USD per Unit"," Quantity per day","Units"]
["From natural resources",null,null,null,null,null,null,null,{"$f":"title5","v":"Size 1"},{"$f":"title9","v":"Dairy cattle"},{"$f":"+I3&J3","v":"Size 1Dairy cattle"},{"$f":"+F$5*E9","v":0},{"$f":"+L3*$F$6","v":0},null,{"$f":"title12","v":"Fuelwood "},0.1,7,{"$f":"title118","v":"Kg/day"}]
["From Energy Data Entry or Intro Page",null,null,null,null,{"$f":"title9","v":"Dairy cattle"},{"$f":"title10","v":"Swine"},{"$f":"title11","v":"Buffalo"},{"$f":"title6","v":"Size 2"},{"$f":"title9","v":"Dairy cattle"},{"$f":"+I4&J4","v":"Size 2Dairy cattle"},{"$f":"+F$5*E10","v":0},{"$f":"+L4*$F$6","v":0},null,{"$f":"title13","v":"Charcoal "},0.27,2.17,{"$f":"title118","v":"Kg/day"}]
[null,"Country Selection",null,null,"Total VS (kg VS/head/day)",{"$f":"IFERROR(('Data entry needs'!$D$13/'Data entry needs'!$F$13)*VLOOKUP(DUMMY_DATABASE!F4,DUMMY_DATABASE!$E$19:$G$23,3,FALSE)*(1000 /365),0)","v":0},{"$f":"IFERROR(('Data entry needs'!$D$13/'Data entry needs'!$F$13)*VLOOKUP(DUMMY_DATABASE!G4,DUMMY_DATABASE!$E$19:$G$23,3,FALSE)*(1000 /365),0)","v":0},{"$f":"IFERROR(('Data entry needs'!$D$13/'Data entry needs'!$F$13)*VLOOKUP(DUMMY_DATABASE!H4,DUMMY_DATABASE!$E$19:$G$23,3,FALSE)*(1000 /365),0)","v":0},{"$f":"title7","v":"Size 3"},{"$f":"title9","v":"Dairy cattle"},"Size 3Dairy cattle",{"$f":"+F$5*E11","v":0},{"$f":"+L5*$F$6","v":0},null,{"$f":"title14","v":"Briquettes/Pellets "},0.2,0.01,{"$f":"title118","v":"Kg/day"}]
[null,"Region",null,null,"Conversion (kg manure/kg VS)",{"$f":"1/G20","v":7.5471698113207539},{"$f":"1/G23","v":4.2372881355932206},{"$f":"1/G19","v":7.3313782991202352},{"$f":"title8","v":"Size 4"},{"$f":"title9","v":"Dairy cattle"},"Size 4Dairy cattle",{"$f":"+F$5*E12","v":0},{"$f":"+L6*$F$6","v":0},null,{"$f":"title15","v":"Kerosene "},1.2,0.19,"L/day"]
{"$rows_left_out":240}
{"sheet":"Country","index":1,"n_rows":245,"n_cols":14,"rows_kept":245,"cut":false,"hidden":true,"merged":[[5,1,5,6],[5,8,5,13]]}
[]
[null,"Selection",{"$f":"VLOOKUP(Start!B2,$A$3:$C$5,3,FALSE)","v":1}]
["EN","English",1]
["FR","French",2]
["ES","Spanish",3]
[null,"List For Selection",null,null,null,null,null,null,"List For Translation"]
{"$rows_left_out":240}
{"sheet":"PROPERTIES_DATABASE","index":2,"n_rows":96,"n_cols":13,"rows_kept":96,"cut":false,"hidden":true,"merged":[[29,1,29,5],[16,2,16,3],[8,1,8,4],[0,1,0,12],[89,1,89,2]]}
[null,"Biogas composition"]
[null,"Manure","CH4","CO2","H2","N2","CO","O2","H2S","NH3","Density (kg/m3)","Calorific Power (MJ/m3)","Calorific Power (MJ/kg)"]
[null,{"$f":"title11","v":"Buffalo"},0.59098274699999997,0.34315127200000001,4.7659899999999998E-2,1.5727766000000001E-2,9.5319790000000001E-4,9.5319790000000001E-4,4.7660140999999999E-4,9.5331979000000004E-5,{"$f":"(0.7168*C3)+(D3*1.9768)+(E3*0.0898)+(F3*1.2507)+(G3*1.2501)+(H3*1.4289)+(I3*1.5392)+(J3*0.7708)","v":1.1292691274491853},{"$f":"(C3*35.786)+0.0532","v":21.202108584142},{"$f":"L3/K3","v":18.775071476569742}]
[null,{"$f":"title9","v":"Dairy cattle"},0.57699999999999996,0.375,3.2499999999999999E-3,2.5000000000000001E-2,3.2499999999999999E-3,0.01,6.0000000000000001E-3,5.0000000000000001E-4,{"$f":"(0.7168*C4)+(D4*1.9768)+(E4*0.0898)+(F4*1.2507)+(G4*1.2501)+(H4*1.4289)+(I4*1.5392)+(J4*0.7708)","v":1.214425375},{"$f":"(C4*35.786)+0.0532","v":20.701722},{"$f":"L4/K4","v":17.046516341113179}]
[null,"Dairy Cattle",0.59099999999999997,0.39200000000000002,3.7637500000000002E-3,3.7637500000000002E-3,3.7637500000000002E-3,3.7637500000000002E-3,1.9300000000000001E-3,1.5E-5,{"$f":"(0.7168*C5)+(D5*1.9768)+(E5*0.0898)+(F5*1.2507)+(G5*1.2501)+(H5*1.4289)+(I5*1.5392)+(J5*0.7708)","v":1.216645011125},{"$f":"(C5*35.786)+0.0532","v":21.202725999999998},{"$f":"L5/K5","v":17.427208270384792}]
[null,"Poultry",0.63800000000000001,0.34300000000000003,9.7999999999999997E-3,4.8999999999999998E-3,9.7999999999999997E-4,9.7999999999999997E-4,2.3400000000000001E-3,0,{"$f":"(0.7168*C6)+(D6*1.9768)+(E6*0.0898)+(F6*1.2507)+(G6*1.2501)+(H6*1.4289)+(I6*1.5392)+(J6*0.7708)","v":1.1485964179999999},{"$f":"(C6*35.786)+0.0532","v":22.884668000000001},{"$f":"L6/K6","v":19.924028702656116}]
{"$rows_left_out":91}
{"sheet":"Model Calculations_ALL","index":3,"n_rows":45,"n_cols":7,"rows_kept":45,"cut":false,"hidden":true,"merged":[[3,1,3,4],[11,1,11,4]]}
[null,{"$f":"title224","v":"Manure type"},{"$f":"+'Data entry needs'!AA92","v":"Dairy cattle"}]
[null,"Location",{"$f":"+'Data entry needs'!$AA$97","v":"Select a country"}]
[]
[null,"Basic properties"]
[null,null,"Density (Kg/m3)","Volatile solids (kg/kg)","Moisture (kg/kg) "]
[null,{"$f":"title11","v":"Buffalo"},960,0.13639999999999999,0.73]
{"$rows_left_out":40}
{"sheet":"MATERIALS_ALL","index":4,"n_rows":100,"n_cols":18,"rows_kept":100,"cut":false,"hidden":true,"merged":[[2,1,2,2],[1,1,1,3],[3,1,3,2],[4,1,4,2],[5,1,5,2]]}
[]
[null,"Lifetime "]
[null,null,null,"years"]
[null,"Fixed-dome reactor",null,20,null,null,null,null,null,null,null,null,"legend"]
[null,"Floating-drum rector",null,20,null,null,null,null,null,null,"Selection",{"$f":"+'Data entry needs'!$AB$103","v":1},"simple",1]
[null,"Tubular reactor",null,10,null,null,null,null,null,null,null,null,"detailed",2]
{"$rows_left_out":95}
{"sheet":"Label","index":5,"n_rows":29,"n_cols":7,"rows_kept":29,"cut":false,"hidden":true,"merged":[]}
[]
[null,"Selection",{"$f":"VLOOKUP(Start!B2,$A$3:$C$5,3,FALSE)","v":1}]
["EN","English",1]
["FR","French",2]
["ES","Spanish",3]
[]
{"$rows_left_out":24}
{"sheet":"Title","index":6,"n_rows":296,"n_cols":7,"rows_kept":296,"cut":false,"hidden":true,"merged":[]}
[]
[null,"Selection",{"$f":"VLOOKUP(Start!B2,$A$3:$C$5,3,FALSE)","v":1}]
["EN","English",1]
["FR","French",2]
["ES","Spanish",3]
[]
{"$rows_left_out":291}
{"sheet":"Start","index":7,"n_rows":28,"n_cols":3,"rows_kept":28,"cut":false,"hidden":false,"merged":[[24,2,26,12],[27,2,27,5],[23,2,23,5]]}
[]
[null,"EN"]
[]
[]
[]
[]
{"$rows_left_out":23}
{"sheet":"Process Description","index":8,"n_rows":11,"n_cols":16,"rows_kept":11,"cut":false,"hidden":false,"merged":[[9,15,9,17],[10,15,10,17],[5,15,5,17],[2,2,2,17],[6,15,6,17],[7,15,7,17],[8,15,8,17],[10,12,10,13],[9,12,9,13],[8,12,8,13],[7,12,7,13],[6,12,6,13],[5,12,5,13]]}
[]
[]
[null,null,{"$f":"title18","v":"BIOGAS SYSTEM FOR RURAL ENERGY"}]
[]
[]
[null,null,null,null,null,null,null,null,null,null,null,null,{"$f":"title19","v":"Non monetary benefits"},null,{"$f":"title25","v":"Effect"},{"$f":"title26","v":"How?"}]
{"$rows_left_out":6}
{"sheet":"Energy_Demand","index":9,"n_rows":30,"n_cols":15,"rows_kept":30,"cut":false,"hidden":false,"merged":[[25,9,25,10],[26,9,26,10],[9,4,9,5],[25,6,25,7],[26,6,26,7],[10,6,10,7],[8,6,9,7],[8,9,9,10],[11,6,11,7],[12,6,12,7],[13,6,13,7],[14,6,14,7],[15,6,15,7],[19,6,19,7],[23,12,23,14],[24,12,24,13],[2,2,2,10],[23,9,23,11],[24,9,24,10],[25,12,25,13],[26,12,26,13],[5,2,5,3],[5,4,5,6],[25,2,27,2],[23,3,23,5],[24,3,24,4],[23,6,23,8],[24,6,24,7],[26,3,26,4],[8,2,10,2],[8,4,8,5],[25,3,25,4],[16,6,16,7],[17,6,17,7],[18,6,18,7]]}
[]
[]
[null,null,{"$f":"title32","v":"ENERGY DEMAND FOR BIOGAS PRODUCTION"}]
[]
[]
[null,null,{"$f":"title33","v":"Use white cells to input data"},null,{"$f":"title34","v":"Grey cells are used for calculations"}]
{"$rows_left_out":25}
{"sheet":"Data entry needs","index":10,"n_rows":106,"n_cols":32,"rows_kept":106,"cut":false,"hidden":false,"merged":[[26,3,28,7],[22,3,24,7],[31,3,33,7],[13,3,13,6],[2,2,2,7],[11,3,11,4],[12,3,12,4],[11,5,11,6],[12,5,12,6],[5,3,5,4],[41,3,41,7],[42,3,42,7],[43,3,43,7],[80,2,81,2],[80,6,81,7],[74,2,75,2]]}
[]
[]
[null,null,{"$f":"title46","v":"DATA ENTRY FOR BIOGAS PRODUCTION"}]
[]
[]
[null,null,{"$f":"title33","v":"Use white cells to input data"},{"$f":"title34","v":"Grey cells are used for calculations"}]
{"$rows_left_out":101}
{"sheet":"COST_SIZE1","index":11,"n_rows":82,"n_cols":11,"rows_kept":82,"cut":false,"hidden":false,"merged":[[5,3,5,5],[2,2,2,10],[59,9,59,10],[13,5,13,6],[13,7,13,8],[13,9,13,10],[22,2,23,2],[22,3,23,3],[27,2,28,2],[27,3,28,3],[54,2,55,2],[54,3,55,3],[12,5,12,10],[16,2,17,2],[16,3,17,3],[68,5,68,10],[59,2,60,2],[59,3,60,3],[59,4,60,4],[72,2,73,2],[72,3,73,3],[72,4,73,4],[69,5,69,6],[69,7,69,8],[69,9,69,10],[60,5,60,6],[60,7,60,8],[60,9,60,10],[59,5,59,6],[59,7,59,8]]}
[]
[]
[null,null,{"$f":"title119&'Data entry needs'!$D$15","v":"PROCESSING COSTS FOR BIOGAS PRODUCTION SIZE 1"}]
[]
[]
[null,null,{"$f":"title33","v":"Use white cells to input data"},{"$f":"title34","v":"Grey cells are used for calculations"}]
{"$rows_left_out":77}
{"sheet":"FA_FIXED_SIZE1","index":12,"n_rows":40,"n_cols":25,"rows_kept":40,"cut":false,"hidden":true,"merged":[[33,24,35,29],[1,1,1,22]]}
[]
[null,{"$f":"title167","v":"FINANCIAL ANALYSIS OF BIOGAS PRODUCTION IN A FIXED DOME BIODIGESTOR"}]
[]
[]
[null,{"$f":"title168","v":"Operating Year"},0,1,2,3,4,5,6,7,8,9,10,11,12,13,14,15,16,17,18,19,20]
[null,{"$f":"title169","v":"Lifetime of the reactor"},20]
{"$rows_left_out":35}
{"sheet":"FA_FLOATING_SIZE1","index":13,"n_rows":40,"n_cols":25,"rows_kept":40,"cut":false,"hidden":true,"merged":[[1,1,1,22],[33,24,35,29]]}
[]
[null,{"$f":"title199","v":"FINANCIAL ANALYSIS OF BIOGAS PRODUCTION IN A FLOATING DRUM BIODIGESTOR"}]
[]
[]
[null,{"$f":"title168","v":"Operating Year"},0,1,2,3,4,5,6,7,8,9,10,11,12,13,14,15,16,17,18,19,20]
[null,{"$f":"title169","v":"Lifetime of the reactor"},20]
{"$rows_left_out":35}
{"sheet":"FA_TUBULAR_SIZE1","index":14,"n_rows":40,"n_cols":25,"rows_kept":40,"cut":false,"hidden":true,"merged":[[1,1,1,22],[33,24,35,29]]}
[]
[null,{"$f":"title200","v":" FINANCIAL ANALYSIS OF BIOGAS PRODUCTION IN A TUBULAR BIODIGESTOR"}]
[]
[]
[null,{"$f":"title168","v":"Operating Year"},0,1,2,3,4,5,6,7,8,9,10,11,12,13,14,15,16,17,18,19,20]
[null,{"$f":"title169","v":"Lifetime of the reactor"},10]
{"$rows_left_out":35}
{"sheet":"COST_SIZE2","index":15,"n_rows":82,"n_cols":11,"rows_kept":82,"cut":false,"hidden":false,"merged":[[2,2,2,10],[5,3,5,5],[12,5,12,10],[13,5,13,6],[13,7,13,8],[13,9,13,10],[16,2,17,2],[16,3,17,3],[22,2,23,2],[22,3,23,3],[27,2,28,2],[27,3,28,3],[68,5,68,10],[54,2,55,2],[54,3,55,3],[59,2,60,2],[59,3,60,3],[59,4,60,4],[59,5,59,6],[59,7,59,8],[59,9,59,10],[60,5,60,6],[60,7,60,8],[60,9,60,10],[69,5,69,6],[69,7,69,8],[69,9,69,10],[72,2,73,2],[72,3,73,3],[72,4,73,4]]}
[]
[]
[null,null,{"$f":"title119&'Data entry needs'!$E$15","v":"PROCESSING COSTS FOR BIOGAS PRODUCTION SIZE 2"}]
[]
[]
[null,null,{"$f":"title33","v":"Use white cells to input data"},{"$f":"title34","v":"Grey cells are used for calculations"}]
{"$rows_left_out":77}
{"sheet":"FA_FIXED_SIZE2","index":16,"n_rows":40,"n_cols":25,"rows_kept":40,"cut":false,"hidden":true,"merged":[[1,1,1,22],[33,24,35,29]]}
[]
[null,{"$f":"title167","v":"FINANCIAL ANALYSIS OF BIOGAS PRODUCTION IN A FIXED DOME BIODIGESTOR"}]
[]
[]
[null,{"$f":"title168","v":"Operating Year"},0,1,2,3,4,5,6,7,8,9,10,11,12,13,14,15,16,17,18,19,20]
[null,{"$f":"title169","v":"Lifetime of the reactor"},20]
{"$rows_left_out":35}
{"sheet":"FA_FLOATING_SIZE2","index":17,"n_rows":40,"n_cols":25,"rows_kept":40,"cut":false,"hidden":true,"merged":[[1,1,1,22],[33,24,35,29]]}
[]
[null,{"$f":"title199","v":"FINANCIAL ANALYSIS OF BIOGAS PRODUCTION IN A FLOATING DRUM BIODIGESTOR"}]
[]
[]
[null,{"$f":"title168","v":"Operating Year"},0,1,2,3,4,5,6,7,8,9,10,11,12,13,14,15,16,17,18,19,20]
[null,{"$f":"title169","v":"Lifetime of the reactor"},20]
{"$rows_left_out":35}
{"sheet":"FA_TUBULAR_SIZE2","index":18,"n_rows":40,"n_cols":25,"rows_kept":40,"cut":false,"hidden":true,"merged":[[1,1,1,22],[33,24,35,29]]}
[]
[null,{"$f":"title200","v":" FINANCIAL ANALYSIS OF BIOGAS PRODUCTION IN A TUBULAR BIODIGESTOR"}]
[]
[]
[null,{"$f":"title168","v":"Operating Year"},0,1,2,3,4,5,6,7,8,9,10,11,12,13,14,15,16,17,18,19,20]
[null,{"$f":"title169","v":"Lifetime of the reactor"},10]
{"$rows_left_out":35}
{"sheet":"COST_SIZE3","index":19,"n_rows":82,"n_cols":11,"rows_kept":82,"cut":false,"hidden":false,"merged":[[2,2,2,10],[5,3,5,5],[12,5,12,10],[13,5,13,6],[13,7,13,8],[13,9,13,10],[16,2,17,2],[16,3,17,3],[22,2,23,2],[22,3,23,3],[27,2,28,2],[27,3,28,3],[68,5,68,10],[54,2,55,2],[54,3,55,3],[59,2,60,2],[59,3,60,3],[59,4,60,4],[59,5,59,6],[59,7,59,8],[59,9,59,10],[60,5,60,6],[60,7,60,8],[60,9,60,10],[69,5,69,6],[69,7,69,8],[69,9,69,10],[72,2,73,2],[72,3,73,3],[72,4,73,4]]}
[]
[]
[null,null,{"$f":"title119&'Data entry needs'!$F$15","v":"PROCESSING COSTS FOR BIOGAS PRODUCTION SIZE 3"}]
[]
[]
[null,null,{"$f":"title33","v":"Use white cells to input data"},{"$f":"title34","v":"Grey cells are used for calculations"}]
{"$rows_left_out":77}
{"sheet":"FA_FIXED_SIZE3","index":20,"n_rows":40,"n_cols":25,"rows_kept":40,"cut":false,"hidden":true,"merged":[[1,1,1,22],[33,24,35,29]]}
[]
[null,{"$f":"title167","v":"FINANCIAL ANALYSIS OF BIOGAS PRODUCTION IN A FIXED DOME BIODIGESTOR"}]
[]
[]
[null,{"$f":"title168","v":"Operating Year"},0,1,2,3,4,5,6,7,8,9,10,11,12,13,14,15,16,17,18,19,20]
[null,{"$f":"title169","v":"Lifetime of the reactor"},20]
{"$rows_left_out":35}
{"sheet":"FA_FLOATING_SIZE3","index":21,"n_rows":40,"n_cols":25,"rows_kept":40,"cut":false,"hidden":true,"merged":[[1,1,1,22],[33,24,35,29]]}
[]
[null,{"$f":"title199","v":"FINANCIAL ANALYSIS OF BIOGAS PRODUCTION IN A FLOATING DRUM BIODIGESTOR"}]
[]
[]
[null,{"$f":"title168","v":"Operating Year"},0,1,2,3,4,5,6,7,8,9,10,11,12,13,14,15,16,17,18,19,20]
[null,{"$f":"title169","v":"Lifetime of the reactor"},20]
{"$rows_left_out":35}
{"sheet":"FA_TUBULAR_SIZE3","index":22,"n_rows":40,"n_cols":25,"rows_kept":40,"cut":false,"hidden":true,"merged":[[1,1,1,22],[33,24,35,29]]}
[]
[null,{"$f":"title200","v":" FINANCIAL ANALYSIS OF BIOGAS PRODUCTION IN A TUBULAR BIODIGESTOR"}]
[]
[]
[null,{"$f":"title168","v":"Operating Year"},0,1,2,3,4,5,6,7,8,9,10,11,12,13,14,15,16,17,18,19,20]
[null,{"$f":"title169","v":"Lifetime of the reactor"},10]
{"$rows_left_out":35}
{"sheet":"COST_SIZE4","index":23,"n_rows":82,"n_cols":11,"rows_kept":82,"cut":false,"hidden":false,"merged":[[2,2,2,10],[5,3,5,5],[12,5,12,10],[13,5,13,6],[13,7,13,8],[13,9,13,10],[16,2,17,2],[16,3,17,3],[22,2,23,2],[22,3,23,3],[27,2,28,2],[27,3,28,3],[68,5,68,10],[54,2,55,2],[54,3,55,3],[59,2,60,2],[59,3,60,3],[59,4,60,4],[59,5,59,6],[59,7,59,8],[59,9,59,10],[60,5,60,6],[60,7,60,8],[60,9,60,10],[69,5,69,6],[69,7,69,8],[69,9,69,10],[72,2,73,2],[72,3,73,3],[72,4,73,4]]}
[]
[]
[null,null,{"$f":"title119&'Data entry needs'!$G$15","v":"PROCESSING COSTS FOR BIOGAS PRODUCTION SIZE 4"}]
[]
[]
[null,null,{"$f":"title33","v":"Use white cells to input data"},{"$f":"title34","v":"Grey cells are used for calculations"}]
{"$rows_left_out":77}
{"sheet":"FA_FIXED_SIZE4","index":24,"n_rows":40,"n_cols":25,"rows_kept":40,"cut":false,"hidden":true,"merged":[[1,1,1,22],[33,24,35,29]]}
[]
[null,{"$f":"title167","v":"FINANCIAL ANALYSIS OF BIOGAS PRODUCTION IN A FIXED DOME BIODIGESTOR"}]
[]
[]
[null,{"$f":"title168","v":"Operating Year"},0,1,2,3,4,5,6,7,8,9,10,11,12,13,14,15,16,17,18,19,20]
[null,{"$f":"title169","v":"Lifetime of the reactor"},20]
{"$rows_left_out":35}
{"sheet":"FA_FLOATING_SIZE4","index":25,"n_rows":40,"n_cols":25,"rows_kept":40,"cut":false,"hidden":true,"merged":[[1,1,1,22],[33,24,35,29]]}
[]
[null,{"$f":"title199","v":"FINANCIAL ANALYSIS OF BIOGAS PRODUCTION IN A FLOATING DRUM BIODIGESTOR"}]
[]
[]
[null,{"$f":"title168","v":"Operating Year"},0,1,2,3,4,5,6,7,8,9,10,11,12,13,14,15,16,17,18,19,20]
[null,{"$f":"title169","v":"Lifetime of the reactor"},20]
{"$rows_left_out":35}
{"sheet":"FA_TUBULAR_SIZE4","index":26,"n_rows":40,"n_cols":25,"rows_kept":40,"cut":false,"hidden":true,"merged":[[1,1,1,22],[33,24,35,29]]}
[]
[null,{"$f":"title200","v":" FINANCIAL ANALYSIS OF BIOGAS PRODUCTION IN A TUBULAR BIODIGESTOR"}]
[]
[]
[null,{"$f":"title168","v":"Operating Year"},0,1,2,3,4,5,6,7,8,9,10,11,12,13,14,15,16,17,18,19,20]
[null,{"$f":"title169","v":"Lifetime of the reactor"},10]
{"$rows_left_out":35}
{"sheet":"Summary of Results-By Size","index":27,"n_rows":242,"n_cols":51,"rows_kept":242,"cut":false,"hidden":false,"merged":[[166,41,166,42],[159,43,159,44],[149,45,149,47],[149,42,149,44],[148,42,148,44],[148,45,148,47],[55,19,55,22],[55,2,55,6],[55,9,55,13],[38,22,39,22],[34,2,35,4],[34,6,35,9],[47,6,50,9],[38,23,39,23],[38,20,39,20],[38,21,39,21],[34,11,35,16],[34,19,35,23],[16,6,16,14],[14,13,14,14],[2,3,2,24],[14,3,14,4],[12,2,12,12],[12,17,12,22],[7,23,7,24],[8,23,8,24],[12,13,12,15]]}
[null,null,null,null,null,null,null,null,null,null,null,null,null,null,null,null,null,null,null,0.2]
[]
[null,null,null,{"$f":"UPPER(title229&'Data entry needs'!$AA$92&title230&$AG$125)","v":"SUMMARY OF RESULTS FOR BIOGAS PRODUCTION FROM DAIRY CATTLE MANURE SIZE 1"}]
[]
[]
[null,null,null,{"$f":"title223","v":"Size Selection"}]
{"$rows_left_out":237}
{"sheet":"Summary of Results-SIZE1","index":28,"n_rows":242,"n_cols":51,"rows_kept":242,"cut":false,"hidden":true,"merged":[[14,3,14,4],[14,6,14,14],[2,3,2,24],[7,23,7,24],[8,23,8,24],[12,2,12,12],[12,17,12,22],[34,2,35,4],[34,6,35,9],[34,11,35,16],[34,19,35,23],[38,20,39,20],[38,21,39,21],[38,22,39,22],[38,23,39,23],[149,42,149,44],[149,45,149,47],[159,43,159,44],[166,41,166,42],[47,6,50,9],[55,2,55,6],[55,9,55,13],[55,19,55,22],[148,42,148,44],[148,45,148,47]]}
[null,null,null,null,null,null,null,null,null,null,null,null,null,null,null,null,null,null,null,0.2]
[]
[null,null,null,{"$f":"UPPER(title229&'Data entry needs'!$AA$92&title230&$AG$125)","v":"SUMMARY OF RESULTS FOR BIOGAS PRODUCTION FROM DAIRY CATTLE MANURE SIZE 1"}]
[]
[]
[]
{"$rows_left_out":237}
{"sheet":"Summary of Results-SIZE2","index":29,"n_rows":242,"n_cols":51,"rows_kept":242,"cut":false,"hidden":true,"merged":[[14,3,14,4],[14,6,14,14],[2,3,2,24],[7,23,7,24],[8,23,8,24],[12,2,12,12],[12,17,12,22],[34,2,35,4],[34,6,35,9],[34,11,35,16],[34,19,35,23],[38,20,39,20],[38,21,39,21],[38,22,39,22],[38,23,39,23],[149,42,149,44],[149,45,149,47],[159,43,159,44],[166,41,166,42],[47,6,50,9],[55,2,55,6],[55,9,55,13],[55,19,55,22],[148,42,148,44],[148,45,148,47]]}
[null,null,null,null,null,null,null,null,null,null,null,null,null,null,null,null,null,null,null,0.2]
[]
[null,null,null,{"$f":"UPPER(title229&'Data entry needs'!$AA$92&title230&$AG$125)","v":"SUMMARY OF RESULTS FOR BIOGAS PRODUCTION FROM DAIRY CATTLE MANURE SIZE 2"}]
[]
[]
[]
{"$rows_left_out":237}
{"sheet":"Summary of Results-SIZE3","index":30,"n_rows":242,"n_cols":51,"rows_kept":242,"cut":false,"hidden":true,"merged":[[14,3,14,4],[14,6,14,14],[2,3,2,24],[7,23,7,24],[8,23,8,24],[12,2,12,12],[12,17,12,22],[34,2,35,4],[34,6,35,9],[34,11,35,16],[34,19,35,23],[38,20,39,20],[38,21,39,21],[38,22,39,22],[38,23,39,23],[149,42,149,44],[149,45,149,47],[159,43,159,44],[166,41,166,42],[47,6,50,9],[55,2,55,6],[55,9,55,13],[55,19,55,22],[148,42,148,44],[148,45,148,47]]}
[null,null,null,null,null,null,null,null,null,null,null,null,null,null,null,null,null,null,null,0.2]
[]
[null,null,null,{"$f":"UPPER(title229&'Data entry needs'!$AA$92&title230&$AG$125)","v":"SUMMARY OF RESULTS FOR BIOGAS PRODUCTION FROM DAIRY CATTLE MANURE SIZE 3"}]
[]
[]
[]
{"$rows_left_out":237}
{"sheet":"Summary of Results-SIZE4","index":31,"n_rows":242,"n_cols":51,"rows_kept":242,"cut":false,"hidden":true,"merged":[[14,3,14,4],[14,6,14,14],[2,3,2,24],[7,23,7,24],[8,23,8,24],[12,2,12,12],[12,17,12,22],[34,2,35,4],[34,6,35,9],[34,11,35,16],[34,19,35,23],[38,20,39,20],[38,21,39,21],[38,22,39,22],[38,23,39,23],[149,42,149,44],[149,45,149,47],[159,43,159,44],[166,41,166,42],[47,6,50,9],[55,2,55,6],[55,9,55,13],[55,19,55,22],[148,42,148,44],[148,45,148,47]]}
[null,null,null,null,null,null,null,null,null,null,null,null,null,null,null,null,null,null,null,0.2]
[]
[null,null,null,{"$f":"UPPER(title229&'Data entry needs'!$AA$92&title230&$AG$125)","v":"SUMMARY OF RESULTS FOR BIOGAS PRODUCTION FROM DAIRY CATTLE MANURE SIZE 4"}]
[]
[]
[]
{"$rows_left_out":237}
{"sheet":"Summary of Results-comparative","index":32,"n_rows":199,"n_cols":51,"rows_kept":199,"cut":false,"hidden":false,"merged":[[15,2,15,7],[5,10,5,14],[34,10,34,14],[11,6,11,7],[2,2,2,17],[7,4,7,5],[8,4,8,5],[9,4,9,5],[10,4,10,5],[11,4,11,5],[7,6,7,7],[8,6,8,7],[9,6,9,7],[10,6,10,7],[15,12,15,17]]}
[null,null,null,null,null,null,null,null,null,null,null,0.2]
[]
[null,null,{"$f":"UPPER(\"SUMMARY OF RESULTS COMPARATIVE FOR BIOGAS PRODUCTION FROM \"&'Data entry needs'!$AA$92&\" MANURE\")","v":"SUMMARY OF RESULTS COMPARATIVE FOR BIOGAS PRODUCTION FROM DAIRY CATTLE MANURE"}]
[]
[]
[null,null,{"$f":"title223","v":"Size Selection"},null,null,null,null,null,null,null,{"$f":"title252","v":"Household beneficiaries"}]
{"$rows_left_out":193}