{"text_format":"1","workbook":"xlsx","n_sheets":17,"sheets":["TestResults","Calculation","Database","Title","START","Process Description","Label","Data Entry Needs","Summary of Results","Sensitivity Sugar-EtOH","COGENERATION","PRODUCTION COST","STORAGE","FA5ML","FA25ML","FA50ML","FA100ML"],"not_rendered":{"charts":18,"images":20,"macros":1,"external_links":1,"defined_names":358,"comments":4,"pivot_tables":0},"unopened":[],"bounds":{"document_bytes":16777216,"sheet_cells":100000,"rows_first":2000,"rows_last":500,"rows_between":2000,"halvings":0,"cell_chars":16384,"cell_head_chars":4096},"cells_cut":0,"cells_raw":0,"read":"whole","date_system":"1900"}

{"sheet":"TestResults","index":0,"n_rows":108,"n_cols":5,"rows_kept":108,"cut":false,"hidden":true,"merged":[]}
[]
[null,"Cell address","Value",null,"Exceptions"]
[null,null,null,null,true]
[null,null,null,null,false]
[null,null,null,null,"USD/t"]
[null,null,null,null,"USD/m3"]
[null,null,null,null,"USD/t/km"]
[null,null,null,null,"USD/l"]
[null,null,null,null,"km"]
[null,null,null,null,"USD/kWh"]
{"$rows_left_out":99}
{"sheet":"Calculation","index":1,"n_rows":27,"n_cols":13,"rows_kept":27,"cut":false,"hidden":true,"merged":[]}
[]
[null,null,5,25,50,100,null,{"$f":"title280","v":"Ethanol Density"},null,0.78900000000000003,"t/m3"]
[null,{"$f":"title13","v":"Molasses"},{"$f":"C$2*1000*0.789/Database!$C$4","v":-4753012.048197872},{"$f":"D$2*1000*0.789/Database!$C$4","v":-23765060.240989361},{"$f":"E$2*1000*0.789/Database!$C$4","v":-47530120.481978722},{"$f":"F$2*1000*0.789/Database!$C$4","v":-95060240.963957444},{"$f":"title47","v":"t/year"}]
[null,{"$f":"title276","v":"Fermentable Sugars"},{"$f":"C3*'Data Entry Needs'!$H$23","v":0},{"$f":"D3*'Data Entry Needs'!$H$23","v":0},{"$f":"E3*'Data Entry Needs'!$H$23","v":0},{"$f":"F3*'Data Entry Needs'!$H$23","v":0},"t/year"]
[null,{"$f":"title173","v":"Lime"},{"$f":"+Database!$C13*C$4^3+Database!$D13*C$4^2+Database!$E13*C$4+Database!$F13","v":5.2107000000000001},{"$f":"+Database!$C13*D$4^3+Database!$D13*D$4^2+Database!$E13*D$4+Database!$F13","v":5.2107000000000001},{"$f":"+Database!$C13*E$4^3+Database!$D13*E$4^2+Database!$E13*E$4+Database!$F13","v":5.2107000000000001},{"$f":"+Database!$C13*F$4^3+Database!$D13*F$4^2+Database!$E13*F$4+Database!$F13","v":5.2107000000000001},"t/year"]
[null,{"$f":"title174","v":"Sulfuric acid"},{"$f":"+Database!$C14*C$4^3+Database!$D14*C$4^2+Database!$E14*C$4+Database!$F14","v":6.6092000000000004},{"$f":"+Database!$C14*D$4^3+Database!$D14*D$4^2+Database!$E14*D$4+Database!$F14","v":6.6092000000000004},{"$f":"+Database!$C14*E$4^3+Database!$D14*E$4^2+Database!$E14*E$4+Database!$F14","v":6.6092000000000004},{"$f":"+Database!$C14*F$4^3+Database!$D14*F$4^2+Database!$E14*F$4+Database!$F14","v":6.6092000000000004},"t/year"]
[null,{"$f":"title14","v":"Water"},{"$f":"+Database!$C15*C$4^3+Database!$D15*C$4^2+Database!$E15*C$4+Database!$F15","v":-1060.8},{"$f":"+Database!$C15*D$4^3+Database!$D15*D$4^2+Database!$E15*D$4+Database!$F15","v":-1060.8},{"$f":"+Database!$C15*E$4^3+Database!$D15*E$4^2+Database!$E15*E$4+Database!$F15","v":-1060.8},{"$f":"+Database!$C15*F$4^3+Database!$D15*F$4^2+Database!$E15*F$4+Database!$F15","v":-1060.8},"t/year"]
[null,{"$f":"title50","v":"Ammonia"},{"$f":"+Database!$C16*C$4^3+Database!$D16*C$4^2+Database!$E16*C$4+Database!$F16","v":1.7744},{"$f":"+Database!$C16*D$4^3+Database!$D16*D$4^2+Database!$E16*D$4+Database!$F16","v":1.7744},{"$f":"+Database!$C16*E$4^3+Database!$D16*E$4^2+Database!$E16*E$4+Database!$F16","v":1.7744},{"$f":"+Database!$C16*F$4^3+Database!$D16*F$4^2+Database!$E16*F$4+Database!$F16","v":1.7744},"t/year"]
[null,{"$f":"title51","v":"Yeast"},{"$f":"+Database!$C17*C$4^3+Database!$D17*C$4^2+Database!$E17*C$4+Database!$F17","v":0.30096000000000001},{"$f":"+Database!$C17*D$4^3+Database!$D17*D$4^2+Database!$E17*D$4+Database!$F17","v":0.30096000000000001},{"$f":"+Database!$C17*E$4^3+Database!$D17*E$4^2+Database!$E17*E$4+Database!$F17","v":0.30096000000000001},{"$f":"+Database!$C17*F$4^3+Database!$D17*F$4^2+Database!$E17*F$4+Database!$F17","v":0.30096000000000001},"t/year"]
[null,{"$f":"title19","v":"Electricity "},{"$f":"C$2*Database!$C$8*1000000000","v":250000},{"$f":"D$2*Database!$C$8*1000000000","v":1250000},{"$f":"E$2*Database!$C$8*1000000000","v":2500000},{"$f":"F$2*Database!$C$8*1000000000","v":5000000},{"$f":"title278","v":"kWh/year"}]
{"$rows_left_out":18}
{"sheet":"Database","index":2,"n_rows":36,"n_cols":12,"rows_kept":36,"cut":false,"hidden":true,"merged":[]}
[null,null,{"$f":"8.3/33.7","v":0.24629080118694363},null,null,null,null,null,"Menus"]
[null,{"$f":"title283","v":"Sugar"},{"$f":"132.5/1000","v":0.13250000000000001},{"$f":"title300","v":"t Sugar/t Sugarcane"},null,null,null,null,{"$f":"title310","v":"trade_balance_bio"},{"$f":"title311","v":"trade_balance_fossil"},{"$f":"title41","v":"Decision"},"Combustibles"]
[null,{"$f":"title171","v":"Molasses"},{"$f":"33.7/1000","v":3.3700000000000001E-2},{"$f":"title301","v":"t Molasses C/t Sugarcane"},null,null,null,null,{"$f":"title36","v":"Select"},{"$f":"title36","v":"Select"},{"$f":"title40","v":"yes"},{"$f":"title36","v":"Select"}]
[null,{"$f":"title121","v":"Ethanol"},{"$f":"$D$4*'Data Entry Needs'!$H$23+Database!$E$4","v":-8.2999999999910923E-4},0.56199999999999806,-8.2999999999910923E-4,{"$f":"title302","v":"t EtOH/t Molasses"},null,null,{"$f":"title37","v":"Net Importer"},{"$f":"title37","v":"Net Importer"},"no",{"$f":"title153","v":"Bagasse"}]
[null,{"$f":"title284","v":"Cachaza"},{"$f":"30/33.7","v":0.89020771513353103},{"$f":"title303","v":"t cachaza/t Molasses"},null,null,null,null,{"$f":"title38","v":"Net Exporter"},{"$f":"title38","v":"Net Exporter"},null,{"$f":"title154","v":"Gasoline"}]
[null,"CO2",{"$f":"6.9/33.7","v":0.20474777448071216},{"$f":"title304","v":"t CO2/t Molasses"},null,{"$f":"C4*1000/0.789","v":-1.0519645120394285},null,null,{"$f":"title39","v":"Interested in Exporting"},null,null,{"$f":"title155","v":"Diesel"}]
[null,{"$f":"title277","v":"Vinasse"},{"$f":"110.4/33.7","v":3.2759643916913945},{"$f":"title305","v":"t Vinasse/t Molasses"},null,null,null,null,null,null,null,{"$f":"title156","v":"Used Oils"}]
[null,{"$f":"title19","v":"Electricity "},5.0000000000000002E-5,{"$f":"title306","v":"GWh/m3 ethanol"},null,null,null,null,null,null,null,{"$f":"title157","v":"LPG"}]
[null,{"$f":"title56","v":"Steam"},3.9668999999999998E-3,{"$f":"title307","v":"1000 t steam/m3 ethanol"},null,null,null,null,null,null,null,{"$f":"title158","v":"Natural Gas"}]
[null,{"$f":"title285","v":"Workers"},22,{"$f":"title308","v":"Fixed Year"},null,null,null,null,null,null,null,{"$f":"title159","v":"Butane"}]
{"$rows_left_out":27}
{"sheet":"Title","index":3,"n_rows":347,"n_cols":7,"rows_kept":347,"cut":false,"hidden":true,"merged":[]}
[]
[null,"Selection",{"$f":"VLOOKUP(START!B2,$A$3:$C$5,3,FALSE)","v":1}]
["EN","English",1]
["FR","French",2]
["ES","Spanish",3]
[]
["ID","English","French","Spanish","Typeof","Ref","Name"]
[1,1,2,3]
[2,"RAPID APPRAISAL ABRIDGED TOOL FOR THE PRODUCTION OF ETHANOL FROM MOLASSES  ","OUTIL ABRÉGÉ D'ÉVALUATION RAPIDE POUR LA PRODUCTION D'ÉTHANOL À PARTIR DE MÉLASSES","HERRAMIENTA ABREVIADA DE EVALUACIÓN RÁPIDA PARA LA PRODUCCIÓN DE ETANOL DE MELAZAS","title",{"$f":"HLOOKUP($C$2,$B$8:$D9,$A9,FALSE)","v":"RAPID APPRAISAL ABRIDGED TOOL FOR THE PRODUCTION OF ETHANOL FROM MOLASSES  "},{"$f":"$E9&$A9","v":"title2"}]
[3,"Disclaimer ","Déni de responsabilité ","Descargo de Responsabilidad ","title",{"$f":"HLOOKUP($C$2,$B$8:$D10,$A10,FALSE)","v":"Disclaimer "},"title3"]
{"$rows_left_out":338}
{"sheet":"START","index":4,"n_rows":32,"n_cols":4,"rows_kept":32,"cut":false,"hidden":false,"merged":[[26,2,26,3],[27,2,30,11],[2,3,2,10]]}
[]
[null,"EN"]
[null,null,null,{"$f":"title2","v":"RAPID APPRAISAL ABRIDGED TOOL FOR THE PRODUCTION OF ETHANOL FROM MOLASSES  "}]
[]
[]
[]
[]
[]
[]
[]
{"$rows_left_out":23}
{"sheet":"Process Description","index":5,"n_rows":26,"n_cols":15,"rows_kept":26,"cut":false,"hidden":false,"merged":[[2,2,2,22],[5,2,5,19]]}
[]
[]
[null,null,{"$f":"title5","v":"PROCESSING SYSTEMS OF LIQUID BIOFUELS FOR TRANSPORTATION"}]
[]
[]
[null,null,{"$f":"title6","v":"PROCESSING OF ETHANOL FROM MOLASSES"}]
[]
[null,null,null,null,null,null,null,null,null,null,{"$f":"title7","v":"Chemical/Energy Inputs"}]
[null,null,null,null,null,null,null,null,null,null,null,null,null,null,{"$f":"title8","v":"Ethanol Transport"}]
[]
{"$rows_left_out":17}
{"sheet":"Label","index":6,"n_rows":30,"n_cols":7,"rows_kept":30,"cut":false,"hidden":true,"merged":[]}
[]
[null,"Selection",{"$f":"VLOOKUP(START!B2,$A$3:$C$5,3,FALSE)","v":1}]
["EN","English",1]
["FR","French",2]
["ES","Spanish",3]
[]
["ID","English","French","Spanish","Typeof","Ref","Name"]
[1,1,2,3]
[2,"Liquid Biofuel Process Description","Description du Processus de Production de Biocarburant Liquide","Descripción del Proceso de Biocombustibles Liquidos","label",{"$f":"HLOOKUP($C$2,$B$8:$D9,$A9,FALSE)","v":"Liquid Biofuel Process Description"},{"$f":"$E9&$A9","v":"label2"}]
[3,"NEXT >> General Data Entry","SUIVANT >> Saisie Générale des Données","SIGUIENTE >> Entrada General de Datos","label",{"$f":"HLOOKUP($C$2,$B$8:$D10,$A10,FALSE)","v":"NEXT >> General Data Entry"},"label3"]
{"$rows_left_out":21}
{"sheet":"Data Entry Needs","index":7,"n_rows":72,"n_cols":9,"rows_kept":72,"cut":false,"hidden":false,"merged":[[57,2,58,2],[45,5,45,6],[2,2,2,8],[24,7,25,8],[13,6,13,7],[16,3,16,4],[16,7,16,8]]}
[]
[]
[null,null,{"$f":"title20","v":"BEFSRA ABRIDGED TOOL FOR THE PRODUCTION OF ETHANOL FROM MOLASSES"}]
[]
[]
[]
[]
[]
[null,null,{"$f":"title21","v":"Step 1: Demand and Trade Balance for Fuels"}]
[]
{"$rows_left_out":63}
{"sheet":"Summary of Results","index":8,"n_rows":316,"n_cols":41,"rows_kept":316,"cut":false,"hidden":false,"merged":[[29,13,29,14],[29,15,29,16],[25,19,25,26],[45,2,45,7],[45,16,45,21],[25,2,25,7],[28,13,28,14],[28,15,28,16],[27,13,27,14],[27,15,27,16],[25,9,25,17],[2,2,2,26],[9,2,9,7],[9,9,9,14],[9,23,9,26],[9,16,9,21]]}
[null,null,0]
[]
[null,null,{"$f":"title91","v":"SUMMARY OF RESULTS FOR THE PRODUCTION OF ETHANOL FROM MOLASSES"}]
[]
[]
[]
[]
[null,null,{"$f":"title92","v":"Results for production costs and investment"}]
[]
[null,null,{"$f":"title93&\" \"&'Data Entry Needs'!$D$17&\" \"&title94","v":"Comparison of production costs vs. fossil fuel prices Select (USD/l gasoline equivalent)"},null,null,null,null,null,null,{"$f":"title95&\" \"&'Data Entry Needs'!$H$17&\" \"&title96","v":"Comparison of production costs vs. biofuel prices Select (USD/l ethanol)"},null,null,null,null,null,null,{"$f":"title97","v":"Components Production Costs"},null,null,null,null,null,null,{"$f":"title98&IF('Data Entry Needs'!$D$58=title40,title99,\"\")&\"(USD)\"","v":"Capital Investment(Cogeneration included)(USD)"}]
{"$rows_left_out":307}
{"sheet":"Sensitivity Sugar-EtOH","index":9,"n_rows":78,"n_cols":38,"rows_kept":78,"cut":false,"hidden":false,"merged":[[2,2,2,8],[8,7,8,8]]}
[]
[]
[null,null,{"$f":"title115","v":"SENSITIVITY ANALYSIS SUGAR/ETHANOL FRACTION"}]
[]
[]
[null,null,{"$f":"title116","v":"Define Parameters for Products in Competition"}]
[null,null,{"$f":"title117","v":"Sugar"},null,null,null,{"$f":"title121","v":"Ethanol"}]
[null,null,{"$f":"title118","v":"Sugar Selling Price"},null,{"$f":"title120","v":"USD/kg Sugar"},null,{"$f":"title122","v":"Ethanol Selling Price"},{"$f":"+'Data Entry Needs'!$D$56","v":0},"USD/l"]
[null,null,{"$f":"title119","v":"Sugar Production Cost"},null,{"$f":"title120","v":"USD/kg Sugar"},null,{"$f":"title123","v":"Ethanol Production Level"},"Select"]
[]
{"$rows_left_out":69}
{"sheet":"COGENERATION","index":10,"n_rows":56,"n_cols":52,"rows_kept":56,"cut":false,"hidden":false,"merged":[[2,2,2,6],[8,2,10,3]]}
[]
[]
[null,null,{"$f":"title133","v":"RAPID SELECTION COGENERATION SYSTEMS"}]
[]
[null,null,{"$f":"title134","v":"Selected Fuel"},"Select"]
[null,null,{"$f":"title135","v":"Energy Potential (MJ/kg)"},{"$f":"IFERROR(VLOOKUP($D$5,$AL$43:$AM$56,2,FALSE),0)","v":0},{"$f":"title136","v":"Fuel Price (USD/kg)"}]
[]
[null,null,{"$f":"title137","v":"Technology Description"}]
[null,null,{"$f":"title138","v":"This technology uses a boiler to produce high pressure steam, which is then used to generate electricity. The low pressure steam obtained is used in the process."},null,{"$f":"title139","v":"Total Thermal Efficiency "},null,0.53]
[null,null,null,null,{"$f":"title140","v":"Electrical Efficiency"},null,0.2]
{"$rows_left_out":47}
{"sheet":"PRODUCTION COST","index":11,"n_rows":74,"n_cols":13,"rows_kept":74,"cut":false,"hidden":false,"merged":[[12,2,13,2],[12,3,13,3],[8,5,8,12],[9,5,9,6],[9,7,9,8],[9,9,9,10],[9,11,9,12],[2,2,2,12],[58,2,59,2],[58,3,59,3],[58,4,59,4],[37,2,38,2],[37,3,38,3],[42,2,43,2],[42,3,43,3],[52,2,53,2],[52,3,53,3],[16,2,17,2],[16,3,17,3],[23,2,24,2],[23,3,24,3],[29,2,30,2],[29,3,30,3]]}
[]
[]
[null,null,{"$f":"title165","v":"DETAILED BUDGET FOR THE PRODUCTION OF ETHANOL FROM SUGARCANE MOLASSES"}]
[]
[]
[]
[null,null,{"$f":"title166","v":"Details of production costs"}]
[]
[null,null,null,null,null,{"$f":"title167","v":"Capacities (Millions of liters per year)"}]
[null,null,null,null,null,5,null,25,null,50,null,100]
{"$rows_left_out":65}
{"sheet":"STORAGE","index":12,"n_rows":93,"n_cols":37,"rows_kept":93,"cut":false,"hidden":true,"merged":[[2,2,2,15],[7,5,7,14],[21,5,21,14]]}
[]
[]
[null,null,{"$f":"title198","v":"BIOMASS STORAGE CALCULATION FOR MOLASSES"}]
[]
[null,null,{"$f":"title199","v":"Biomass Safety Stock Rate Definition"}]
[]
[]
[null,null,null,null,null,{"$f":"title207","v":"Capacity (million of litres)"}]
[null,null,null,{"$f":"title52","v":"Unit"},null,5,null,null,25,null,null,50,null,null,100]
[null,null,{"$f":"title200","v":"Biomass consumption"},{"$f":"title47","v":"t/year"},null,{"$f":"'PRODUCTION COST'!$F$15","v":-4753012.048197872},null,null,{"$f":"'PRODUCTION COST'!$H$15","v":-23765060.240989361},null,null,{"$f":"'PRODUCTION COST'!$J$15","v":-47530120.481978722},null,null,{"$f":"'PRODUCTION COST'!$L$15","v":-95060240.963957444}]
{"$rows_left_out":84}
{"sheet":"FA5ML","index":13,"n_rows":80,"n_cols":23,"rows_kept":80,"cut":false,"hidden":true,"merged":[[1,1,1,13]]}
[]
[null,{"$f":"title225","v":"Monthly Consumption of Biomass Stocked"}]
[]
[]
[{"$f":"title228","v":"Ethanol Revenue (Earnings)"}]
[]
[null,{"$f":"title237","v":"Operating Year"},0,1,2,3,4,5,6,7,8,9,10,11,12,13,14,15,16,17,18,19,20]
[]
[null,{"$f":"title207","v":"Capacity (million of litres)"},5,{"$f":"C9","v":5},5,5,5,5,5,5,5,5,5,5,5,5,5,5,5,5,5,5,5]
[null,{"$f":"title229","v":"Annual production (litres per year)"},{"$f":"+C9*1000000","v":5000000},{"$f":"+C10","v":5000000},5000000,5000000,5000000,5000000,5000000,5000000,5000000,5000000,5000000,5000000,5000000,5000000,5000000,5000000,5000000,5000000,5000000,5000000,5000000]
{"$rows_left_out":71}
{"sheet":"FA25ML","index":14,"n_rows":80,"n_cols":23,"rows_kept":80,"cut":false,"hidden":true,"merged":[[1,1,1,13]]}
[]
[null,{"$f":"title273","v":"FINANCIAL ASSESSMENT OF ETHANOL PRODUCTION 25 MILLION LITRES/YEAR"}]
[]
[]
[{"$f":"title228","v":"Ethanol Revenue (Earnings)"}]
[]
[null,{"$f":"title237","v":"Operating Year"},0,1,2,3,4,5,6,7,8,9,10,11,12,13,14,15,16,17,18,19,20]
[]
[null,{"$f":"title207","v":"Capacity (million of litres)"},25,{"$f":"C9","v":25},25,25,25,25,25,25,25,25,25,25,25,25,25,25,25,25,25,25,25]
[null,{"$f":"title229","v":"Annual production (litres per year)"},{"$f":"+C9*1000000","v":25000000},{"$f":"+C10","v":25000000},25000000,25000000,25000000,25000000,25000000,25000000,25000000,25000000,25000000,25000000,25000000,25000000,25000000,25000000,25000000,25000000,25000000,25000000,25000000]
{"$rows_left_out":71}
{"sheet":"FA50ML","index":15,"n_rows":80,"n_cols":23,"rows_kept":80,"cut":false,"hidden":true,"merged":[[1,1,1,13]]}
[]
[null,{"$f":"title274","v":"FINANCIAL ASSESSMENT OF ETHANOL PRODUCTION 50 MILLION LITRES/YEAR"}]
[]
[]
[{"$f":"title228","v":"Ethanol Revenue (Earnings)"}]
[]
[null,{"$f":"title237","v":"Operating Year"},0,1,2,3,4,5,6,7,8,9,10,11,12,13,14,15,16,17,18,19,20]
[]
[null,{"$f":"title207","v":"Capacity (million of litres)"},50,{"$f":"C9","v":50},50,50,50,50,50,50,50,50,50,50,50,50,50,50,50,50,50,50,50]
[null,{"$f":"title229","v":"Annual production (litres per year)"},{"$f":"+C9*1000000","v":50000000},{"$f":"+C10","v":50000000},50000000,50000000,50000000,50000000,50000000,50000000,50000000,50000000,50000000,50000000,50000000,50000000,50000000,50000000,50000000,50000000,50000000,50000000,50000000]
{"$rows_left_out":71}
{"sheet":"FA100ML","index":16,"n_rows":80,"n_cols":23,"rows_kept":80,"cut":false,"hidden":true,"merged":[[1,1,1,13]]}
[]
[null,{"$f":"title275","v":"FINANCIAL ASSESSMENT OF ETHANOL PRODUCTION 100 MILLION LITRES/YEAR"}]
[]
[]
[{"$f":"title228","v":"Ethanol Revenue (Earnings)"}]
[]
[null,{"$f":"title237","v":"Operating Year"},0,1,2,3,4,5,6,7,8,9,10,11,12,13,14,15,16,17,18,19,20]
[]
[null,{"$f":"title207","v":"Capacity (million of litres)"},100,{"$f":"C9","v":100},100,100,100,100,100,100,100,100,100,100,100,100,100,100,100,100,100,100,100]
[null,{"$f":"title229","v":"Annual production (litres per year)"},{"$f":"+C9*1000000","v":100000000},{"$f":"+C10","v":100000000},100000000,100000000,100000000,100000000,100000000,100000000,100000000,100000000,100000000,100000000,100000000,100000000,100000000,100000000,100000000,100000000,100000000,100000000,100000000]
{"$rows_left_out":70}