{"text_format":"1","workbook":"xlsx","n_sheets":23,"sheets":["START","Description","Data Entry Needs","Allocator","PARAMETERS","COLL&AGG","SUPPLY_COSTS","SUPPLY_GHG","FA_Biomass","FA_MSP","Summary of results","COLLECTION","SIZERED_C","BALING_C","DRYING_C","MILLING_C","DENSIFICATION_C","STORAGE_C","TRANSPORT_C","DRYING_A","MILLING_A","DENSIFICATION_A","STORAGE_A"],"not_rendered":{"charts":69,"images":69,"macros":1,"external_links":1,"defined_names":108,"comments":0,"pivot_tables":0},"unopened":[],"bounds":{"document_bytes":16777216,"sheet_cells":100000,"rows_first":2000,"rows_last":500,"rows_between":2000,"halvings":0,"cell_chars":16384,"cell_head_chars":4096},"cells_cut":0,"cells_raw":0,"read":"whole","date_system":"1900"}

{"sheet":"START","index":0,"n_rows":39,"n_cols":3,"rows_kept":39,"cut":false,"hidden":false,"merged":[[34,2,37,11]]}
[]
[]
[]
[]
[]
[]
[]
[]
[]
[]
[]
[]
[]
[]
[]
{"$rows_left_out":25}
{"sheet":"Description","index":1,"n_rows":3,"n_cols":3,"rows_kept":3,"cut":false,"hidden":false,"merged":[[36,2,39,11],[2,2,3,11]]}
[]
[]
[null,null,"DESCRIPTION, BIOMASS COLLECTION AND MOBILIZATION"]

{"sheet":"Data Entry Needs","index":2,"n_rows":493,"n_cols":41,"rows_kept":493,"cut":false,"hidden":false,"merged":[[12,6,13,8],[5,3,5,4],[2,2,2,8],[34,2,34,8],[57,2,57,8]]}
[]
[]
[null,null,"DATA ENTRY FOR BIOMASS SUPPLY & MOBILIZATION"]
[]
[]
[null,null,"Use white cells to input data","Grey cells are used for calculations"]
[]
[null,null,"Biomass Availability",null,null,null,"Collection centres & aggregation centres land coverage"]
[]
[null,null,"Biomass type",null,"Please select",null,"Collection centre radius (km)"]
[null,null,"Residue type",null,"",null,"Share of land covered with targeted feedstock (%)"]
[null,null,"Biomass potential (t/year)",null,null,null,"Aggregation centre influence radius (km)"]
[null,null,"Biomass yield (t/ha, wet)",null,null,null,{"$f":"IF(N260, \"The influence radius of the aggregation centre needs to be larger than that of the collection centre\",\"The number of collection & aggregation centres required will be estimated based on the inputs provided above\")","v":"The influence radius of the aggregation centre needs to be larger than that of the collection centre"}]
[null,null,"Biomass bulk density (kg/m3)"]
[null,null,"Biomass moisture content (wt%)"]
{"$rows_left_out":479}
{"sheet":"Allocator","index":3,"n_rows":240,"n_cols":21,"rows_kept":240,"cut":false,"hidden":true,"merged":[]}
[]
[null,"Allocator "]
[]
[null,"Feedstock capacity per collection site, and land capacity per collection site"]
[]
[null,null,"Capacity per input total","Capacity per collection site",null,"Real biomass collected per site"]
[null,"Feedstock","t/y","t/year","Moisture","t/year",null,null,null,"Assumption, collection always considered as first step"]
[null,{"$f":"'Data Entry Needs'!$E$11","v":""},{"$f":"'Data Entry Needs'!$E$12","v":0},{"$f":"'COLL&AGG'!$S$48","v":0},{"$f":"'Data Entry Needs'!$E$15","v":0},{"$f":"IF(D8<C8,D8,C8)","v":0}]
[]
[]
[null,null,"Capacity per input total","Capacity per collection site",null,"Real biomass collected per site"]
[null,"Feedstock","ha/y","ha/year",null,"ha/year"]
[null,{"$f":"'Data Entry Needs'!$E$11","v":""},{"$f":"'COLL&AGG'!$S$43","v":""},{"$f":"'COLL&AGG'!$S$47","v":0},null,{"$f":"IF(D13<C13,D13,C13)","v":0}]
[]
[]
{"$rows_left_out":226}
{"sheet":"PARAMETERS","index":4,"n_rows":131,"n_cols":13,"rows_kept":131,"cut":false,"hidden":false,"merged":[[95,7,95,8],[96,7,96,8],[55,7,55,8],[51,7,51,8],[79,7,79,8],[80,7,80,8],[81,7,81,8],[61,7,61,8],[62,7,62,8],[56,7,56,8],[57,7,57,8],[69,7,69,8],[70,7,70,8],[71,7,71,8],[25,7,25,8],[29,7,29,8],[46,7,46,8],[41,7,41,8],[42,7,42,8],[30,7,30,8],[31,7,31,8],[36,7,36,8],[37,7,37,8],[38,7,38,8],[39,7,39,8],[40,7,40,8],[32,7,32,8],[2,2,2,8],[5,2,5,3],[5,4,5,6],[16,7,16,8],[24,7,24,8],[20,7,20,8],[21,7,21,8],[22,7,22,8],[23,7,23,8],[14,7,14,8],[15,7,15,8],[10,2,10,8],[7,2,8,8],[47,7,47,8],[48,7,48,8],[49,7,49,8],[50,7,50,8],[68,7,68,8],[63,7,63,8],[64,7,64,8],[105,7,105,8],[72,7,72,8],[101,7,101,8],[102,7,102,8],[103,7,103,8],[104,7,104,8],[74,2,74,8],[78,7,78,8],[82,7,82,8],[86,7,86,8],[87,7,87,8],[88,7,88,8],[89,7,89,8],[97,7,97,8],[90,7,90,8],[94,7,94,8]]}
[]
[]
[null,null,{"$f":"+\"DEFAULT PARAMETERS USED IN EACH OPERATION\"","v":"DEFAULT PARAMETERS USED IN EACH OPERATION"}]
[]
[]
[null,null,"Use white cells to input data",null,"Grey cells are used for calculations"]
[]
[null,null,"The user is encouraged to review and modify the default parameters for each operation type for more accurate results. "]
[]
[]
[null,null,"Operations at collection centre level"]
[]
[null,null,"Biomass collection"]
[]
[null,null,"Share of machinery use in semi-mechanized collection mode (%)",null,null,null,null,0.5]
{"$rows_left_out":117}
{"sheet":"COLL&AGG","index":5,"n_rows":57,"n_cols":20,"rows_kept":57,"cut":false,"hidden":true,"merged":[[18,6,18,8],[19,6,19,8],[23,6,23,8],[24,6,24,8],[25,6,25,8],[17,6,17,8],[5,2,5,3],[5,4,5,6],[2,2,2,8],[9,6,9,8],[10,6,10,8],[11,6,11,8],[15,6,15,8],[16,6,16,8]]}
[]
[]
[null,null,{"$f":"+\"CALCULATION OF COLLECTION & AGGREGATION CENTRES OF \"&UPPER('Data Entry Needs'!$E$11&\" \")","v":"CALCULATION OF COLLECTION & AGGREGATION CENTRES OF  "}]
[]
[]
[null,null,"Use white cells to input data",null,"Colored cells are used for calculations"]
[]
[null,null,"Total collection land required"]
[]
[null,null,{"$f":"+\"Total Available \"&('Data Entry Needs'!$E$11&\"  (t/year)\")","v":"Total Available   (t/year)"},null,null,null,{"$f":"'Data Entry Needs'!$E$12","v":0}]
[null,null,{"$f":"+('Data Entry Needs'!$E$11&\" yield (t/ha, wet)\")","v":" yield (t/ha, wet)"},null,null,null,{"$f":"'Data Entry Needs'!$E$13","v":0}]
[null,null,{"$f":"+\"Total land required for collecting \"&('Data Entry Needs'!$E$11&\"  (ha)\")","v":"Total land required for collecting   (ha)"},null,null,null,{"$f":"$S$43","v":""}]
[]
[null,null,"Collection centres"]
[]
{"$rows_left_out":43}
{"sheet":"SUPPLY_COSTS","index":6,"n_rows":124,"n_cols":12,"rows_kept":124,"cut":false,"hidden":true,"merged":[[5,2,5,3],[5,4,5,6],[2,2,2,11],[9,7,9,11],[14,5,15,5],[14,4,15,4],[14,3,15,3],[10,7,10,11],[36,3,37,3],[36,4,37,4],[14,11,15,11],[14,10,15,10],[14,9,15,9],[14,8,15,8],[14,7,15,7],[14,6,15,6],[34,2,34,11],[56,7,56,11],[57,7,57,11],[61,3,62,3],[61,4,62,4],[61,5,62,5],[61,6,62,6],[61,7,62,7],[103,2,103,11],[105,7,105,11],[107,3,108,3],[107,4,108,4],[81,2,81,11],[83,3,84,3],[83,4,84,4]]}
[]
[]
[null,null,{"$f":"+\"SUMMARY OF SUPPLY COSTS OF \"&UPPER('Data Entry Needs'!$E$11&\" \")","v":"SUMMARY OF SUPPLY COSTS OF  "}]
[]
[]
[null,null,"Use white cells to input data",null,"Grey cells are used for calculations"]
[]
[null,null,"Summary of costs per collection centre"]
[]
[null,null,{"$f":"+('Data Entry Needs'!$E$11&\" supply capacity per collection centre (t/y)\")","v":" supply capacity per collection centre (t/y)"},null,null,null,null,{"$f":"Allocator!$F$30","v":""}]
[null,null,"Number of collection centres",null,null,null,null,{"$f":"Allocator!$F$31","v":""}]
[]
[]
[]
[null,null,null,"Collection","Primary size reduction","Baling","Drying ","Milling/ Grinding","Densification","Transport","Storage","Total per collection site"]
{"$rows_left_out":110}
{"sheet":"SUPPLY_GHG","index":7,"n_rows":87,"n_cols":12,"rows_kept":87,"cut":false,"hidden":true,"merged":[[81,3,82,3],[81,4,82,4],[57,2,57,11],[62,3,63,3],[62,4,63,4],[77,2,77,11],[79,7,79,11],[31,3,32,3],[31,4,32,4],[43,7,43,11],[44,7,44,11],[48,3,49,3],[48,4,49,4],[48,5,49,5],[48,6,49,6],[48,7,49,7],[24,2,24,11],[6,2,6,3],[6,4,6,6],[2,2,3,11],[15,3,16,3],[15,4,16,4],[15,5,16,5],[15,6,16,6],[15,7,16,7],[15,8,16,8],[15,9,16,9],[15,10,16,10],[15,11,16,11],[10,7,10,11],[11,7,11,11]]}
[]
[]
[null,null,{"$f":"+\"SUMMARY OF GHG EMISSIONS OF \"&UPPER('Data Entry Needs'!$E$11&\" Supply\")","v":"SUMMARY OF GHG EMISSIONS OF  SUPPLY"}]
[]
[]
[]
[null,null,"Use white cells to input data",null,"Grey cells are used for calculations"]
[]
[null,null,"Summary of GHG emissions per collection site"]
[]
[null,null,{"$f":"+('Data Entry Needs'!$E$11&\" supply capacity per collection site (t/y)\")","v":" supply capacity per collection site (t/y)"},null,null,null,null,{"$f":"IFERROR(Allocator!$F$30,\"\")","v":""}]
[null,null,"Number of collection sites",null,null,null,null,{"$f":"IFERROR(Allocator!$F$31,\"\")","v":""}]
[]
[]
[]
{"$rows_left_out":73}
{"sheet":"FA_Biomass","index":8,"n_rows":81,"n_cols":24,"rows_kept":81,"cut":false,"hidden":true,"merged":[[2,2,2,4]]}
[]
[]
[null,null,{"$f":"+\"FINANCIAL ANALYSIS OF \"&UPPER('Data Entry Needs'!$E$11&\" \")","v":"FINANCIAL ANALYSIS OF  "}]
[]
[]
[null,null,"Summary of total supply costs"]
[]
[null,null,"Summary of costs ","USD/y"]
[null,null,{"$f":"Allocator!B97","v":"Labor Unskilled"},{"$f":"Allocator!C97","v":""}]
[null,null,{"$f":"Allocator!B98","v":"Labor Skilled"},{"$f":"Allocator!C98","v":""}]
[null,null,{"$f":"Allocator!B99","v":"Miscelaneous"},{"$f":"Allocator!C99","v":""}]
[null,null,{"$f":"Allocator!B100","v":"Machinery Rental"},{"$f":"Allocator!C100","v":""}]
[null,null,{"$f":"Allocator!B101","v":"Building Rental"},{"$f":"Allocator!C101","v":""}]
[null,null,{"$f":"Allocator!B102","v":"Depreciation"},{"$f":"Allocator!C102","v":""}]
[null,null,{"$f":"Allocator!B103","v":"Maintenance"},{"$f":"Allocator!C103","v":""}]
{"$rows_left_out":67}
{"sheet":"FA_MSP","index":9,"n_rows":90,"n_cols":29,"rows_kept":90,"cut":false,"hidden":true,"merged":[[2,2,2,4],[73,3,73,4]]}
[]
[]
[null,null,{"$f":"+\"MINIMUM SELLING PRICE OF \"&UPPER('Data Entry Needs'!$E$11&\" \")","v":"MINIMUM SELLING PRICE OF  "}]
[]
[]
[null,null,"Summary of total supply costs"]
[]
[null,null,"Summary of costs ","USD/y"]
[null,null,{"$f":"Allocator!B97","v":"Labor Unskilled"},{"$f":"Allocator!C97","v":""}]
[null,null,{"$f":"Allocator!B98","v":"Labor Skilled"},{"$f":"Allocator!C98","v":""}]
[null,null,{"$f":"Allocator!B99","v":"Miscelaneous"},{"$f":"Allocator!C99","v":""}]
[null,null,{"$f":"Allocator!B100","v":"Machinery Rental"},{"$f":"Allocator!C100","v":""}]
[null,null,{"$f":"Allocator!B101","v":"Building Rental"},{"$f":"Allocator!C101","v":""}]
[null,null,{"$f":"Allocator!B102","v":"Depreciation"},{"$f":"Allocator!C102","v":""}]
[null,null,{"$f":"Allocator!B103","v":"Maintenance"},{"$f":"Allocator!C103","v":""}]
{"$rows_left_out":76}
{"sheet":"Summary of results","index":10,"n_rows":249,"n_cols":50,"rows_kept":249,"cut":false,"hidden":false,"merged":[[132,2,132,11],[132,13,132,22],[6,2,6,3],[6,4,6,6],[2,2,3,22],[41,3,41,9],[41,11,41,21],[39,2,39,22],[10,2,10,22],[100,2,100,22],[101,16,128,22],[71,2,71,6],[71,8,71,12],[71,14,71,22]]}
[]
[]
[null,null,{"$f":"+\"SUMMARY OF RESULTS OF \"&UPPER('Data Entry Needs'!$E$11&\" Supply\")","v":"SUMMARY OF RESULTS OF  SUPPLY"}]
[]
[]
[]
[null,null,"Use white cells to input data",null,"Grey cells are used for calculations"]
[]
[null,null,"Operating results"]
[]
[null,null,"Supply chain sequence "]
[]
[]
[]
[]
{"$rows_left_out":235}
{"sheet":"COLLECTION","index":11,"n_rows":183,"n_cols":34,"rows_kept":183,"cut":false,"hidden":true,"merged":[[59,5,59,8],[59,2,59,4],[41,5,42,8],[41,2,41,4],[2,2,2,8],[5,2,5,3],[5,4,5,6],[13,6,13,8],[14,6,14,8],[9,2,9,8],[19,6,19,8],[20,6,20,8],[21,6,21,8],[22,6,22,8],[15,6,15,8]]}
[]
[]
[null,null,{"$f":"+\"CALCULATION OF COLLECTION COSTS OF \"&UPPER('Data Entry Needs'!$E$11&\" \")","v":"CALCULATION OF COLLECTION COSTS OF  "}]
[]
[]
[null,null,"Use white cells to input data",null,"Grey cells are used for calculations"]
[]
[null,null,"Collection mode"]
[]
[null,null,{"$f":"P75","v":"Operation not included in sequence. Check data entry"}]
[]
[null,null,"Biomass collected per collection centre"]
[]
[null,null,{"$f":"+\"Collected \"&('Data Entry Needs'!$E$11&\" (t/year)\")","v":"Collected  (t/year)"},null,null,null,{"$f":"IFERROR(AH149,\"\")","v":0}]
[null,null,{"$f":"+\"Moisture content of collected \"&('Data Entry Needs'!$E$11&\" (wt%)\")","v":"Moisture content of collected  (wt%)"},null,null,null,{"$f":"IFERROR(P98,\"\")","v":0.5}]
{"$rows_left_out":169}
{"sheet":"SIZERED_C","index":12,"n_rows":266,"n_cols":38,"rows_kept":266,"cut":false,"hidden":true,"merged":[[2,2,2,8],[5,2,5,3],[5,4,5,6],[9,2,9,8],[13,6,13,8],[54,2,54,4],[54,5,54,8],[14,6,14,8],[41,7,43,8],[22,6,22,8],[15,6,15,8],[19,6,19,8],[20,6,20,8],[21,6,21,8]]}
[]
[]
[null,null,{"$f":"+\"CALCULATION OF PRIMARY SIZE REDUCTION COSTS OF \"&UPPER('Data Entry Needs'!$E$11&\" \")","v":"CALCULATION OF PRIMARY SIZE REDUCTION COSTS OF  "}]
[]
[]
[null,null,"Use white cells to input data",null,"Grey cells are used for calculations"]
[]
[null,null,"Primary size reduction technology at the collection centre"]
[]
[null,null,{"$f":"R78","v":"Operation not included in sequence. Check data entry"}]
[]
[null,null,"Primary size reduction input parameters"]
[]
[null,null,{"$f":"+('Data Entry Needs'!$E$11&\" to be chipped (t/year)\")","v":" to be chipped (t/year)"},null,null,null,{"$f":"IFERROR(R86,0)","v":0}]
[null,null,{"$f":"+\"Moisture content of  \"&('Data Entry Needs'!$E$11&\" (wt%)\")","v":"Moisture content of   (wt%)"},null,null,null,{"$f":"IFERROR(R89,0)","v":0}]
{"$rows_left_out":252}
{"sheet":"BALING_C","index":13,"n_rows":148,"n_cols":40,"rows_kept":148,"cut":false,"hidden":true,"merged":[[53,2,53,4],[53,5,53,8],[2,2,2,8],[5,2,5,3],[5,4,5,6],[9,2,9,8],[13,6,13,8],[14,6,14,8],[18,6,18,8],[19,6,19,8],[20,6,20,8],[21,6,21,8],[40,7,42,8]]}
[]
[]
[null,null,{"$f":"+\"CALCULATION OF BALING COSTS OF \"&UPPER('Data Entry Needs'!$E$11&\" \")","v":"CALCULATION OF BALING COSTS OF  "}]
[]
[]
[null,null,"Use white cells to input data",null,"Grey cells are used for calculations"]
[]
[null,null,"Baling technology at the collection centre"]
[]
[null,null,{"$f":"U69","v":"Operation not included in sequence. Check data entry"}]
[]
[null,null,"Baling input parameters"]
[]
[null,null,{"$f":"+('Data Entry Needs'!$E$11&\" to be baled (t/year)\")","v":" to be baled (t/year)"},null,null,null,{"$f":"IFERROR(U82,0)","v":0}]
[null,null,{"$f":"+\"Initial moisture content of  \"&('Data Entry Needs'!$E$11&\" (wt%)\")","v":"Initial moisture content of   (wt%)"},null,null,null,{"$f":"IFERROR(W82,0)","v":0}]
{"$rows_left_out":134}
{"sheet":"DRYING_C","index":14,"n_rows":283,"n_cols":44,"rows_kept":283,"cut":false,"hidden":true,"merged":[[52,2,52,4],[52,5,52,8],[38,6,40,8],[14,6,14,8],[18,6,18,8],[19,6,19,8],[9,2,9,8],[2,2,2,8],[5,2,5,3],[5,4,5,6],[13,6,13,8]]}
[]
[]
[null,null,{"$f":"+\"CALCULATION OF DRYING COSTS OF \"&UPPER('Data Entry Needs'!$E$11&\" \")","v":"CALCULATION OF DRYING COSTS OF  "}]
[]
[]
[null,null,"Use white cells to input data",null,"Grey cells are used for calculations"]
[]
[null,null,"Drying technology at the collection centre"]
[]
[null,null,{"$f":"S72","v":"Operation not included in sequence. Check data entry"}]
[]
[null,null,"Drying input parameters"]
[]
[null,null,{"$f":"+('Data Entry Needs'!$E$11&\" to be dried (t/year)\")","v":" to be dried (t/year)"},null,null,null,{"$f":"IFERROR(S85,0)","v":0}]
[null,null,{"$f":"+\"Initial moisture content of  \"&('Data Entry Needs'!$E$11&\" (wt%)\")","v":"Initial moisture content of   (wt%)"},null,null,null,{"$f":"IFERROR(U85,0)","v":0}]
{"$rows_left_out":269}
{"sheet":"MILLING_C","index":15,"n_rows":286,"n_cols":43,"rows_kept":286,"cut":false,"hidden":true,"merged":[[52,2,52,4],[52,5,52,8],[2,2,2,8],[5,2,5,3],[5,4,5,6],[9,2,9,8],[13,6,13,8],[14,6,14,8],[18,6,18,8],[19,6,19,8],[20,6,20,8],[39,7,41,8]]}
[]
[]
[null,null,{"$f":"+\"CALCULATION OF MILLING/GRINDING COSTS OF \"&UPPER('Data Entry Needs'!$E$11&\" \")","v":"CALCULATION OF MILLING/GRINDING COSTS OF  "}]
[]
[]
[null,null,"Use white cells to input data",null,"Grey cells are used for calculations"]
[]
[null,null,"Milling technology at the collection centre"]
[]
[null,null,{"$f":"U70","v":"Operation not included in sequence. Check data entry"}]
[]
[null,null,"Milling input parameters"]
[]
[null,null,{"$f":"+('Data Entry Needs'!$E$11&\" to be milled (t/year)\")","v":" to be milled (t/year)"},null,null,null,{"$f":"U81","v":0}]
[null,null,{"$f":"+('Data Entry Needs'!$E$11&\" average input particle size (mm)\")","v":" average input particle size (mm)"},null,null,null,{"$f":"IFERROR(U88*U74,0)","v":0}]
{"$rows_left_out":272}
{"sheet":"DENSIFICATION_C","index":16,"n_rows":124,"n_cols":45,"rows_kept":124,"cut":false,"hidden":true,"merged":[[38,7,40,8],[51,2,51,4],[51,5,51,8],[14,6,14,8],[18,6,18,8],[19,6,19,8],[2,2,2,8],[5,2,5,3],[5,4,5,6],[9,2,9,8],[13,6,13,8]]}
[]
[]
[null,null,{"$f":"+\"CALCULATION OF DENSIFICATION COSTS OF \"&UPPER('Data Entry Needs'!$E$11&\" \")","v":"CALCULATION OF DENSIFICATION COSTS OF  "}]
[]
[]
[null,null,"Use white cells to input data",null,"Grey cells are used for calculations"]
[]
[null,null,"Densification technology at the collection centre"]
[]
[null,null,{"$f":"U69","v":"Operation not included in sequence. Check data entry"}]
[]
[null,null,"Densification input parameters"]
[]
[null,null,{"$f":"+('Data Entry Needs'!$E$11&\" to be densified (t/y)\")","v":" to be densified (t/y)"},null,null,null,{"$f":"U80","v":0}]
[null,null,"Initial biomass density (kg/m3)",null,null,null,{"$f":"U105","v":0}]
{"$rows_left_out":110}
{"sheet":"STORAGE_C","index":17,"n_rows":122,"n_cols":37,"rows_kept":122,"cut":false,"hidden":true,"merged":[[13,6,13,8],[2,2,2,8],[5,2,5,3],[5,4,5,6],[11,6,11,8],[12,6,12,8],[7,2,7,8],[68,7,70,8],[83,2,83,4],[83,5,83,8],[14,6,14,8],[32,6,32,8],[33,6,33,8],[34,6,34,8]]}
[]
[]
[null,null,{"$f":"+\"CALCULATION OF STORAGE COSTS OF \"&UPPER('Data Entry Needs'!$E$11&\" \")","v":"CALCULATION OF STORAGE COSTS OF  "}]
[]
[]
[null,null,"Use white cells to input data",null,"Grey cells are used for calculations"]
[]
[null,null,{"$f":"S64","v":"Operation not included in sequence. Check data entry"}]
[]
[null,null,"Storage input parameters at collection centre"]
[]
[null,null,{"$f":"+('Data Entry Needs'!$E$11&\" available (t/year)\")","v":" available (t/year)"},null,null,null,{"$f":"S71","v":0}]
[null,null,{"$f":"+('Data Entry Needs'!$E$11&\" available (t/month)\")","v":" available (t/month)"},null,null,null,{"$f":"S72","v":0}]
[null,null,{"$f":"+('Data Entry Needs'!$E$11&\" available (t/day)\")","v":" available (t/day)"},null,null,null,{"$f":"S73","v":0}]
[null,null,{"$f":"+('Data Entry Needs'!$E$11&\" safety stock rate (t/day)\")","v":" safety stock rate (t/day)"},null,null,null,{"$f":"IFERROR('Data Entry Needs'!E112*Y69,0)","v":0}]
{"$rows_left_out":108}
{"sheet":"TRANSPORT_C","index":18,"n_rows":341,"n_cols":44,"rows_kept":341,"cut":false,"hidden":true,"merged":[[56,2,56,4],[56,5,56,8],[24,6,24,8],[2,2,2,8],[5,2,5,3],[5,4,5,6],[9,2,9,8],[14,6,14,8],[15,6,15,8],[13,6,13,8],[20,6,20,8],[21,6,21,8],[22,6,22,8],[23,6,23,8],[43,7,45,8],[16,6,16,8]]}
[]
[]
[null,null,{"$f":"+\"CALCULATION OF TRANSPORT COSTS OF \"&UPPER('Data Entry Needs'!$E$11&\" \")","v":"CALCULATION OF TRANSPORT COSTS OF  "}]
[]
[]
[null,null,"Use white cells to input data",null,"Grey cells are used for calculations"]
[]
[null,null,"Truck selected for transport"]
[]
[null,null,{"$f":"U74","v":"Operation not included in sequence. Check data entry"}]
[]
[null,null,"Transport input parameters"]
[]
[null,null,{"$f":"+('Data Entry Needs'!$E$11&\" to be transported (t/y)\")","v":" to be transported (t/y)"},null,null,null,{"$f":"IFERROR(U85,\"\")","v":0}]
[null,null,"Truck max. payload (t)",null,null,null,{"$f":"IFERROR(AK109*U78,\"\")","v":0}]
{"$rows_left_out":327}
{"sheet":"DRYING_A","index":19,"n_rows":283,"n_cols":44,"rows_kept":283,"cut":false,"hidden":true,"merged":[[18,6,18,8],[19,6,19,8],[38,6,40,8],[52,2,52,4],[52,5,52,8],[14,6,14,8],[2,2,2,8],[5,2,5,3],[5,4,5,6],[9,2,9,8],[13,6,13,8]]}
[]
[]
[null,null,{"$f":"+\"CALCULATION OF DRYING COSTS OF \"&UPPER('Data Entry Needs'!$E$11&\" \")","v":"CALCULATION OF DRYING COSTS OF  "}]
[]
[]
[null,null,"Use white cells to input data",null,"Grey cells are used for calculations"]
[]
[null,null,"Drying technology at the collection centre"]
[]
[null,null,{"$f":"S70","v":"Operation not included in sequence. Check data entry"}]
[]
[null,null,"Drying input parameters"]
[]
[null,null,{"$f":"+('Data Entry Needs'!$E$11&\" to be dried (t/year)\")","v":" to be dried (t/year)"},null,null,null,{"$f":"S85","v":0}]
[null,null,{"$f":"+\"Initial moisture content of  \"&('Data Entry Needs'!$E$11&\" (wt%)\")","v":"Initial moisture content of   (wt%)"},null,null,null,{"$f":"U85","v":0}]
{"$rows_left_out":269}
{"sheet":"MILLING_A","index":20,"n_rows":286,"n_cols":43,"rows_kept":286,"cut":false,"hidden":true,"merged":[[18,6,18,8],[19,6,19,8],[20,6,20,8],[39,7,41,8],[52,2,52,4],[52,5,52,8],[14,6,14,8],[2,2,2,8],[5,2,5,3],[5,4,5,6],[9,2,9,8],[13,6,13,8]]}
[]
[]
[null,null,{"$f":"+\"CALCULATION OF MILLING/GRINDING COSTS OF \"&UPPER('Data Entry Needs'!$E$11&\" \")","v":"CALCULATION OF MILLING/GRINDING COSTS OF  "}]
[]
[]
[null,null,"Use white cells to input data",null,"Grey cells are used for calculations"]
[]
[null,null,"Milling technology at the collection centre"]
[]
[null,null,{"$f":"U69","v":"Operation not included in sequence. Check data entry"}]
[]
[null,null,"Milling input parameters"]
[]
[null,null,{"$f":"+('Data Entry Needs'!$E$11&\" to be milled (t/year)\")","v":" to be milled (t/year)"},null,null,null,{"$f":"U81","v":0}]
[null,null,{"$f":"+('Data Entry Needs'!$E$11&\" average input particle size (mm)\")","v":" average input particle size (mm)"},null,null,null,{"$f":"IFERROR(U88*U73,0)","v":0}]
{"$rows_left_out":272}
{"sheet":"DENSIFICATION_A","index":21,"n_rows":124,"n_cols":45,"rows_kept":124,"cut":false,"hidden":true,"merged":[[18,6,18,8],[19,6,19,8],[38,7,40,8],[51,2,51,4],[51,5,51,8],[14,6,14,8],[2,2,2,8],[5,2,5,3],[5,4,5,6],[9,2,9,8],[13,6,13,8]]}
[]
[]
[null,null,{"$f":"+\"CALCULATION OF DENSIFICATION COSTS OF \"&UPPER('Data Entry Needs'!$E$11&\" \")","v":"CALCULATION OF DENSIFICATION COSTS OF  "}]
[]
[]
[null,null,"Use white cells to input data",null,"Grey cells are used for calculations"]
[]
[null,null,"Truck selected for transport"]
[]
[null,null,{"$f":"U68","v":"Operation not included in sequence. Check data entry"}]
[]
[null,null,"Transport input parameters"]
[]
[null,null,{"$f":"+('Data Entry Needs'!$E$11&\" to be densified (t/y)\")","v":" to be densified (t/y)"},null,null,null,{"$f":"U80","v":0}]
[null,null,"Initial biomass density (kg/m3)",null,null,null,{"$f":"U105","v":0}]
{"$rows_left_out":110}
{"sheet":"STORAGE_A","index":22,"n_rows":122,"n_cols":37,"rows_kept":122,"cut":false,"hidden":true,"merged":[[83,2,83,4],[83,5,83,8],[2,2,2,8],[5,2,5,3],[5,4,5,6],[11,6,11,8],[12,6,12,8],[13,6,13,8],[14,6,14,8],[32,6,32,8],[33,6,33,8],[34,6,34,8],[68,7,70,8],[7,2,7,8]]}
[]
[]
[null,null,{"$f":"+\"CALCULATION OF STORAGE COSTS OF \"&UPPER('Data Entry Needs'!$E$11&\" \")","v":"CALCULATION OF STORAGE COSTS OF  "}]
[]
[]
[null,null,"Use white cells to input data",null,"Grey cells are used for calculations"]
[]
[null,null,{"$f":"S64","v":"Operation not included in sequence. Check data entry"}]
[]
[null,null,"Storage input parameters at aggregation centre"]
[]
[null,null,{"$f":"+('Data Entry Needs'!$E$11&\" available (t/year)\")","v":" available (t/year)"},null,null,null,{"$f":"S71","v":0}]
[null,null,{"$f":"+('Data Entry Needs'!$E$11&\" available (t/month)\")","v":" available (t/month)"},null,null,null,{"$f":"S72","v":0}]
[null,null,{"$f":"+('Data Entry Needs'!$E$11&\" available (t/day)\")","v":" available (t/day)"},null,null,null,{"$f":"S73","v":0}]
[null,null,{"$f":"+('Data Entry Needs'!$E$11&\" safety stock rate (t/day)\")","v":" safety stock rate (t/day)"},null,null,null,{"$f":"IFERROR('Data Entry Needs'!E112*Y69,0)","v":0}]
{"$rows_left_out":107}